program: Orca
programVersion: 5.0.2
elementType: S S S P O O C C C C C C C C C H H H H H H H H H H H H H H H H H H H H H
charge: 0
multiplicity: 1
keywords: wb97x-d3
keywords: def2-TZVPP
keywords: def2/J RIJCOSX
keywords: DEFGRID2
keywords: scfconv7
keywords: smallprint printgap noloewdin
keywords: NOSOSCF
formula: C9H21O2PS3
InChI: InChI=1/C9H21O2PS3/c1-6-10-12(13,11-7-2)15-8-14-9(3,4)5/h6-8H2,1-5H3
36 atoms
S  1.712103 -1.064827 -0.963515
S  0.696268 1.480982 0.472906
S  -1.67611 0.465388 -1.747355
P  -1.180432 0.670821 0.1056
O  -1.198104 -0.64184 1.014773
O  -2.098799 1.650377 0.985862
C  3.044218 -1.564131 0.206113
C  2.901635 -3.081305 0.289325
C  4.406095 -1.191267 -0.362694
C  2.851669 -0.951783 1.585767
C  1.675489 0.724059 -0.880917
C  -2.217686 -1.656625 0.845442
C  -2.539034 2.92247 0.46166
C  -1.677036 -2.840223 0.085748
C  -3.997239 2.859425 0.087465
H  2.998435 -3.557129 -0.688288
H  3.686936 -3.485116 0.931224
H  1.94007 -3.370757 0.716522
H  4.575573 -1.659374 -1.332689
H  5.196468 -1.52363 0.31464
H  4.516303 -0.11207 -0.482769
H  3.012732 0.126066 1.585065
H  1.85456 -1.147552 1.979953
H  3.580663 -1.386549 2.2740
H  2.675405 1.14759 -0.777715
H  1.267258 1.080224 -1.825716
H  -2.516599 -1.937835 1.854538
H  -3.094181 -1.239776 0.345298
H  -2.363899 3.649851 1.253421
H  -1.930227 3.217441 -0.39625
H  -2.444607 -3.614122 0.045392
H  -1.411093 -2.571664 -0.935845
H  -0.799345 -3.26488 0.574002
H  -4.16909 2.155599 -0.726613
H  -4.61485 2.569582 0.937772
H  -4.326255 3.844885 -0.243689
elementType: S P O C H
totalener: -2042.18588429 hartree
nucrepener: 1731.03619251 hartree
electener: -3773.22207680 hartree
oneelecener: -6258.04661177 hartree
twoeener: 2484.82453497 hartree
cpcmener: -0.01959423 hartree
kineticenergy: 2036.97694710 hartree
xcener: -124.859909768122 hartree
chargesum: 0.0000000
charge: -0.171377 -0.160632 -0.467642 0.674255 -0.349878 -0.373613 0.197900 -0.297162 -0.322080 -0.324515 -0.137309 0.054601 0.046152 -0.246041 -0.239420 0.104899 0.100569 0.105117 0.095525 0.099358 0.100704 0.090703 0.094191 0.106811 0.154782 0.158390 0.107491 0.087851 0.109893 0.081658 0.103628 0.075830 0.080923 0.074080 0.089851 0.094508
qa: -0.1714 -0.1606 -0.4676 0.6743 -0.3499 -0.3736 0.1979 -0.2972 -0.3221 -0.3245 -0.1373 0.0546 0.0462 -0.2460 -0.2394 0.1049 0.1006 0.1051 0.0955 0.0994 0.1007 0.0907 0.0942 0.1068 0.1548 0.1584 0.1075 0.0879 0.1099 0.0817 0.1036 0.0758 0.0809 0.0741 0.0899 0.0945
va: 2.2444 2.2960 1.9613 5.3950 2.0809 2.0743 3.8541 3.8799 3.9391 3.9243 3.9857 3.8388 3.8499 3.9339 3.9407 1.0084 1.0047 1.0064 1.0139 1.0030 1.0036 1.0010 1.0200 1.0071 1.0042 1.0175 0.9969 1.0117 0.9946 1.0150 1.0113 1.0149 1.0037 1.0194 1.0035 1.0080
dispcorr: -0.018167683 hartree
energy: -2042.204051973561
dipole: 8.45337 -7.82800 0.62537 -10.78338 10.89786 0.11448 5.27531 -4.33191 0.94340
magnitude: 1.13762 au
magnitude: 2.89161 debye
