program: Orca
programVersion: 5.0.2
elementType: S S S P O O C C C C C C C C C H H H H H H H H H H H H H H H H H H H H H
charge: 0
multiplicity: 1
keywords: wb97x-d3
keywords: def2-TZVPP
keywords: def2/J RIJCOSX
keywords: DEFGRID2
keywords: scfconv7
keywords: smallprint printgap noloewdin
keywords: NOSOSCF
formula: C9H21O2PS3
InChI: InChI=1/C9H21O2PS3/c1-6-10-12(13,11-7-2)15-8-14-9(3,4)5/h6-8H2,1-5H3
36 atoms
S  1.842291 -0.885659 -0.984433
S  0.507721 1.509534 0.484634
S  -1.648528 0.282545 -1.847986
P  -1.223702 0.453161 0.02514
O  -1.038528 -0.900492 0.85538
O  -2.302415 1.20616 0.94099
C  3.144716 -1.315815 0.24716
C  3.215542 -2.838807 0.175611
C  4.479386 -0.706977 -0.157412
C  2.7592 -0.878945 1.651954
C  1.622735 0.888439 -0.83205
C  -1.58351 -2.158816 0.412649
C  -3.144219 2.272606 0.459513
C  -3.075779 -2.240637 0.619187
C  -2.416514 3.589117 0.34374
H  3.467631 -3.190452 -0.826528
H  3.99018 -3.198574 0.855364
H  2.272396 -3.30028 0.472456
H  4.78545 -1.035291 -1.150735
H  5.253941 -1.010057 0.551099
H  4.45035 0.383761 -0.15351
H  1.781398 -1.263765 1.941382
H  3.496651 -1.25969 2.362984
H  2.740363 0.205849 1.753652
H  2.571281 1.398991 -0.660752
H  1.233742 1.23888 -1.787131
H  -1.319721 -2.319436 -0.633882
H  -1.064509 -2.909474 1.006011
H  -3.584256 1.982699 -0.496454
H  -3.948194 2.33896 1.190466
H  -3.612064 -1.529227 -0.009662
H  -3.417925 -3.240408 0.350341
H  -3.34847 -2.062938 1.659291
H  -1.93737 3.867104 1.282486
H  -1.66157 3.574925 -0.441977
H  -3.139176 4.366732 0.094662
elementType: S P O C H
totalener: -2042.18548447 hartree
nucrepener: 1738.24048345 hartree
electener: -3780.42596792 hartree
oneelecener: -6272.44138819 hartree
twoeener: 2492.01542027 hartree
cpcmener: -0.01904205 hartree
kineticenergy: 2036.98776149 hartree
xcener: -124.864484528872 hartree
chargesum: 0.0000000
charge: -0.175036 -0.159933 -0.465049 0.668075 -0.351952 -0.370977 0.199779 -0.295275 -0.321893 -0.333211 -0.136928 0.047821 0.038406 -0.244565 -0.249713 0.104214 0.099307 0.105969 0.095112 0.099583 0.102514 0.097663 0.106240 0.094020 0.154026 0.157868 0.086891 0.109032 0.092102 0.109447 0.076906 0.097578 0.090562 0.090858 0.077393 0.103169
qa: -0.1750 -0.1599 -0.4650 0.6681 -0.3520 -0.3710 0.1998 -0.2953 -0.3219 -0.3332 -0.1369 0.0478 0.0384 -0.2446 -0.2497 0.1042 0.0993 0.1060 0.0951 0.0996 0.1025 0.0977 0.1062 0.0940 0.1540 0.1579 0.0869 0.1090 0.0921 0.1094 0.0769 0.0976 0.0906 0.0909 0.0774 0.1032
va: 2.2420 2.2881 1.9695 5.3855 2.0784 2.0830 3.8519 3.8717 3.9353 3.9263 3.9852 3.8342 3.8632 3.9337 3.8963 1.0095 1.0042 1.0090 1.0143 1.0030 1.0029 1.0157 1.0072 1.0043 1.0049 1.0173 1.0170 0.9888 1.0128 0.9911 1.0186 1.0078 1.0063 1.0039 1.0181 1.0104
dispcorr: -0.018209917 hartree
energy: -2042.203694383410
dipole: 9.45784 -8.86576 0.59208 -6.97440 7.01558 0.04118 7.18835 -6.25652 0.93183
magnitude: 1.10479 au
magnitude: 2.80814 debye
