program: Orca
programVersion: 5.0.2
elementType: S S S P O O C C C C C C C C C H H H H H H H H H H H H H H H H H H H H H
charge: 0
multiplicity: 1
keywords: wb97x-d3
keywords: def2-TZVPP
keywords: def2/J RIJCOSX
keywords: DEFGRID2
keywords: scfconv7
keywords: smallprint printgap noloewdin
keywords: NOSOSCF
formula: C9H21O2PS3
InChI: InChI=1/C9H21O2PS3/c1-6-10-12(13,11-7-2)15-8-14-9(3,4)5/h6-8H2,1-5H3
36 atoms
S  2.118892 -0.055066 0.927249
S  -0.628266 -1.172555 1.161269
S  -1.08323 0.393924 -1.823589
P  -1.695449 0.216342 -0.005444
O  -3.201086 -0.279801 0.202248
O  -1.830669 1.541244 0.877553
C  3.450608 -0.065975 -0.348002
C  3.971254 -1.479606 -0.564708
C  2.942272 0.53475 -1.650808
C  4.54545 0.814624 0.245978
C  0.964452 -1.301939 0.307533
C  -3.879083 -1.114982 -0.756612
C  -0.719981 2.268055 1.435139
C  -3.364994 -2.533519 -0.78496
C  0.008963 3.111708 0.419815
H  4.815632 -1.457539 -1.257898
H  4.313351 -1.928573 0.368104
H  3.214306 -2.13351 -0.999948
H  2.584081 1.554198 -1.505104
H  2.129524 -0.048944 -2.083907
H  3.751104 0.562249 -2.385211
H  4.189295 1.827077 0.444505
H  4.936886 0.400982 1.17637
H  5.374532 0.889561 -0.460393
H  0.799098 -1.206156 -0.76603
H  1.315067 -2.31219 0.515827
H  -4.922236 -1.089438 -0.447299
H  -3.810821 -0.656701 -1.744634
H  -1.164507 2.893336 2.207602
H  -0.035861 1.572032 1.925307
H  -3.392863 -2.994384 0.201889
H  -4.005866 -3.118211 -1.445556
H  -2.348382 -2.596892 -1.17181
H  -0.67038 3.781096 -0.107819
H  0.741535 3.725484 0.945174
H  0.545475 2.505984 -0.30868
elementType: S P O C H
totalener: -2042.18358433 hartree
nucrepener: 1727.08800660 hartree
electener: -3769.27159094 hartree
oneelecener: -6249.59142525 hartree
twoeener: 2480.31983432 hartree
cpcmener: -0.01773524 hartree
kineticenergy: 2036.97617991 hartree
xcener: -124.865123282725 hartree
chargesum: 0.0000000
charge: -0.190096 -0.162430 -0.444784 0.652860 -0.363397 -0.346181 0.204356 -0.325075 -0.337142 -0.292077 -0.105768 0.039028 0.029226 -0.245398 -0.235973 0.102102 0.100041 0.097652 0.102877 0.096133 0.109498 0.104099 0.102812 0.098629 0.128464 0.153210 0.110449 0.095801 0.115084 0.088392 0.089856 0.103589 0.074805 0.097570 0.102163 0.049623
qa: -0.1901 -0.1624 -0.4448 0.6529 -0.3634 -0.3462 0.2044 -0.3251 -0.3371 -0.2921 -0.1058 0.0390 0.0292 -0.2454 -0.2360 0.1021 0.1000 0.0977 0.1029 0.0961 0.1095 0.1041 0.1028 0.0986 0.1285 0.1532 0.1104 0.0958 0.1151 0.0884 0.0899 0.1036 0.0748 0.0976 0.1022 0.0496
va: 2.2221 2.3000 1.9974 5.4096 2.1019 2.1085 3.8488 3.9226 3.9544 3.8689 3.9742 3.8479 3.8477 3.8901 3.8856 1.0037 1.0118 1.0008 0.9987 1.0049 1.0069 1.0099 1.0116 1.0042 1.0300 0.9996 0.9914 1.0124 0.9932 1.0165 1.0058 1.0103 1.0153 1.0113 1.0089 1.0251
dispcorr: -0.018882099 hartree
energy: -2042.202466430867
dipole: 19.06457 -18.14336 0.92121 -0.19471 -0.50429 -0.69900 -6.34718 6.19016 -0.15703
magnitude: 1.16700 au
magnitude: 2.96627 debye
