program: Orca
programVersion: 5.0.2
elementType: S S S P O O C C C C C C C C C H H H H H H H H H H H H H H H H H H H H H
charge: 0
multiplicity: 1
keywords: wb97x-d3
keywords: def2-TZVPP
keywords: def2/J RIJCOSX
keywords: DEFGRID2
keywords: scfconv7
keywords: smallprint printgap noloewdin
keywords: NOSOSCF
formula: C9H21O2PS3
InChI: InChI=1/C9H21O2PS3/c1-6-10-12(13,11-7-2)15-8-14-9(3,4)5/h6-8H2,1-5H3
36 atoms
S  2.06687 -0.181768 -1.085908
S  -0.142542 -1.510486 0.665869
S  -1.787104 0.219068 -1.776068
P  -1.358272 0.080836 0.099411
O  -2.603796 -0.103927 1.092377
O  -0.614715 1.325836 0.770195
C  3.32213 -0.158755 0.268324
C  4.456801 0.6870 -0.303569
C  2.760796 0.511841 1.516185
C  3.821982 -1.55913 0.583996
C  1.007459 -1.588821 -0.755493
C  -3.836299 -0.74162 0.705855
C  -1.035836 2.679764 0.48108
C  -3.706641 -2.238208 0.567971
C  -0.058879 3.350241 -0.450303
H  5.236871 0.804864 0.451118
H  4.906464 0.222653 -1.181816
H  4.117594 1.686891 -0.58173
H  1.923548 -0.044313 1.934845
H  2.423858 1.526972 1.304306
H  3.538594 0.570506 2.28182
H  4.181095 -2.07328 -0.308056
H  4.652156 -1.494478 1.290818
H  3.054623 -2.177405 1.051258
H  0.414771 -1.733512 -1.658897
H  1.58013 -2.502294 -0.59738
H  -4.537561 -0.485071 1.498115
H  -4.198253 -0.293716 -0.221206
H  -2.043329 2.690516 0.06024
H  -1.076707 3.188495 1.443342
H  -3.069725 -2.519266 -0.270552
H  -3.311004 -2.694127 1.475416
H  -4.696155 -2.658837 0.386585
H  0.94733 3.36429 -0.031113
H  -0.026475 2.852288 -1.418393
H  -0.369454 4.382767 -0.611103
elementType: S P O C H
totalener: -2042.18570061 hartree
nucrepener: 1739.55088576 hartree
electener: -3781.73658636 hartree
oneelecener: -6275.09077216 hartree
twoeener: 2493.35418580 hartree
cpcmener: -0.01886379 hartree
kineticenergy: 2036.97943267 hartree
xcener: -124.862049980145 hartree
chargesum: -0.0000000
charge: -0.170699 -0.158604 -0.466029 0.670904 -0.371638 -0.343734 0.198984 -0.289976 -0.343138 -0.326187 -0.139717 0.039834 0.045150 -0.248500 -0.249609 0.097772 0.100979 0.103257 0.094878 0.094034 0.107403 0.104683 0.104345 0.092463 0.159628 0.158588 0.109097 0.093508 0.090455 0.108555 0.074732 0.090544 0.103593 0.086153 0.074460 0.103834
qa: -0.1707 -0.1586 -0.4660 0.6709 -0.3716 -0.3437 0.1990 -0.2900 -0.3431 -0.3262 -0.1397 0.0398 0.0452 -0.2485 -0.2496 0.0978 0.1010 0.1033 0.0949 0.0940 0.1074 0.1047 0.1043 0.0925 0.1596 0.1586 0.1091 0.0935 0.0905 0.1086 0.0747 0.0905 0.1036 0.0862 0.0745 0.1038
va: 2.2523 2.2914 1.9702 5.3884 2.0880 2.0885 3.8536 3.8762 3.9340 3.9258 3.9969 3.8593 3.8432 3.8938 3.9386 1.0049 1.0144 1.0081 1.0235 1.0073 1.0081 1.0097 1.0038 0.9995 1.0167 0.9945 0.9916 1.0125 1.0098 0.9968 1.0184 1.0043 1.0109 1.0019 1.0168 1.0114
dispcorr: -0.018784094 hartree
energy: -2042.204484700837
dipole: 13.61261 -13.39058 0.22203 3.17055 -3.32857 -0.15802 5.89649 -4.79213 1.10436
magnitude: 1.13749 au
magnitude: 2.89127 debye
