program: Orca
programVersion: 5.0.2
elementType: S S S P O O C C C C C C C C C H H H H H H H H H H H H H H H H H H H H H
charge: 0
multiplicity: 1
keywords: wb97x-d3
keywords: def2-TZVPP
keywords: def2/J RIJCOSX
keywords: DEFGRID2
keywords: scfconv7
keywords: smallprint printgap noloewdin
keywords: NOSOSCF
formula: C9H21O2PS3
InChI: InChI=1/C9H21O2PS3/c1-6-10-12(13,11-7-2)15-8-14-9(3,4)5/h6-8H2,1-5H3
36 atoms
S  2.070368 -0.383131 1.337091
S  0.320485 -0.579944 -1.227832
S  -2.551639 0.858367 -1.950861
P  -1.567086 -0.046599 -0.564277
O  -2.148426 -1.441847 -0.042091
O  -1.386766 0.742664 0.817613
C  3.699893 -0.188574 0.489644
C  4.285481 -1.538626 0.1042
C  3.583612 0.716689 -0.728461
C  4.575193 0.474562 1.550357
C  1.085476 -1.395765 0.23341
C  -3.566374 -1.676598 0.099848
C  -1.322978 2.179558 0.897978
C  -4.174789 -0.946603 1.271758
C  -0.059495 2.757727 0.308357
H  4.343767 -2.211862 0.959654
H  3.712799 -2.030727 -0.682825
H  5.297381 -1.397476 -0.282806
H  3.145872 1.68196 -0.471914
H  2.976762 0.270833 -1.5163
H  4.577269 0.896258 -1.146883
H  4.695092 -0.158265 2.430698
H  5.56801 0.658742 1.135199
H  4.169445 1.435548 1.871301
H  1.672973 -2.21684 -0.174454
H  0.303561 -1.854441 0.836796
H  -4.066868 -1.407155 -0.832283
H  -3.65299 -2.753967 0.226975
H  -2.207833 2.602454 0.41847
H  -1.385583 2.395383 1.963208
H  -4.197312 0.132871 1.121836
H  -5.205552 -1.281601 1.391509
H  -3.645147 -1.162271 2.199419
H  0.828895 2.295479 0.737667
H  -0.02257 2.642068 -0.774859
H  -0.030978 3.825527 0.527801
elementType: S P O C H
totalener: -2042.18588589 hartree
nucrepener: 1709.14783945 hartree
electener: -3751.33372534 hartree
oneelecener: -6213.71927811 hartree
twoeener: 2462.38555277 hartree
cpcmener: -0.01965450 hartree
kineticenergy: 2036.96596308 hartree
xcener: -124.859986721905 hartree
chargesum: 0.0000000
charge: -0.163942 -0.151882 -0.460704 0.647722 -0.354288 -0.350343 0.191720 -0.327149 -0.342300 -0.292981 -0.160034 0.026992 0.039697 -0.238705 -0.240717 0.103400 0.100836 0.102139 0.103608 0.099569 0.107549 0.104090 0.099345 0.105695 0.160753 0.156591 0.091485 0.109913 0.094304 0.113513 0.079275 0.099882 0.090248 0.075102 0.074013 0.105604
qa: -0.1639 -0.1519 -0.4607 0.6477 -0.3543 -0.3503 0.1917 -0.3271 -0.3423 -0.2930 -0.1600 0.0270 0.0397 -0.2387 -0.2407 0.1034 0.1008 0.1021 0.1036 0.0996 0.1075 0.1041 0.0993 0.1057 0.1608 0.1566 0.0915 0.1099 0.0943 0.1135 0.0793 0.0999 0.0902 0.0751 0.0740 0.1056
va: 2.2441 2.2890 1.9988 5.3997 2.0915 2.0536 3.8595 3.9228 3.9386 3.8645 4.0290 3.8647 3.8311 3.8950 3.8947 1.0131 0.9989 1.0030 1.0043 1.0067 1.0061 1.0121 1.0045 1.0079 1.0008 1.0179 1.0120 0.9904 1.0137 0.9902 1.0149 1.0089 1.0065 1.0288 1.0180 1.0145
dispcorr: -0.018511167 hartree
energy: -2042.204397062207
dipole: 16.91829 -15.94571 0.97258 2.83671 -3.31326 -0.47655 10.10878 -8.81809 1.29069
magnitude: 1.68490 au
magnitude: 4.28268 debye
