program: Orca
programVersion: 5.0.2
elementType: S S S P O O C C C C C C C C C H H H H H H H H H H H H H H H H H H H H H
charge: 0
multiplicity: 1
keywords: wb97x-d3
keywords: def2-TZVPP
keywords: def2/J RIJCOSX
keywords: DEFGRID2
keywords: scfconv7
keywords: smallprint printgap noloewdin
keywords: NOSOSCF
formula: C9H21O2PS3
InChI: InChI=1/C9H21O2PS3/c1-6-10-12(13,11-7-2)15-8-14-9(3,4)5/h6-8H2,1-5H3
36 atoms
S  1.771534 -1.077087 1.262276
S  -0.192762 1.193953 1.363215
S  -0.42685 1.442645 -2.031809
P  -1.190401 0.723914 -0.417639
O  -1.324487 -0.861968 -0.495036
O  -2.659556 1.204986 -0.011074
C  2.929539 -1.578968 -0.084674
C  2.235569 -1.53103 -1.438704
C  4.174001 -0.702668 -0.074646
C  3.296608 -3.017958 0.264092
C  1.50328 0.686132 0.950053
C  -1.951243 -1.652258 0.535683
C  -3.252335 2.43808 -0.465181
C  -1.536707 -3.088492 0.353307
C  -2.729489 3.639006 0.282084
H  2.924991 -1.865226 -2.218598
H  1.360581 -2.181214 -1.463649
H  1.911088 -0.524811 -1.707253
H  4.668559 -0.721034 0.89714
H  3.948069 0.336062 -0.321009
H  4.886969 -1.061914 -0.821176
H  3.799109 -3.087189 1.230093
H  2.419584 -3.667733 0.288459
H  3.977075 -3.413821 -0.492873
H  2.145187 1.299543 1.581728
H  1.710329 0.954075 -0.08714
H  -1.65054 -1.288921 1.52126
H  -3.034117 -1.544944 0.449089
H  -3.091346 2.542993 -1.53972
H  -4.320657 2.309444 -0.297453
H  -2.049369 -3.702091 1.094958
H  -1.806538 -3.465307 -0.633765
H  -0.463575 -3.211869 0.497404
H  -2.868348 3.536599 1.358521
H  -1.673281 3.818967 0.080111
H  -3.281388 4.522184 -0.042555
elementType: S P O C H
totalener: -2042.19888888 hartree
nucrepener: 1729.81217986 hartree
electener: -3772.01106873 hartree
oneelecener: -6255.09746498 hartree
twoeener: 2483.08639624 hartree
cpcmener: -0.01600598 hartree
kineticenergy: 2036.95515777 hartree
xcener: -124.856674690471 hartree
chargesum: -0.0000000
charge: -0.185017 -0.158684 -0.440869 0.648090 -0.327855 -0.353328 0.197316 -0.325176 -0.318237 -0.296557 -0.103481 -0.002925 0.034696 -0.227147 -0.243974 0.105316 0.094360 0.084565 0.098529 0.098008 0.099607 0.103309 0.108598 0.098242 0.157661 0.117418 0.102555 0.113333 0.093784 0.105483 0.095591 0.091650 0.066242 0.091185 0.076875 0.100837
qa: -0.1850 -0.1587 -0.4409 0.6481 -0.3279 -0.3533 0.1973 -0.3252 -0.3182 -0.2966 -0.1035 -0.0029 0.0347 -0.2271 -0.2440 0.1053 0.0944 0.0846 0.0985 0.0980 0.0996 0.1033 0.1086 0.0982 0.1577 0.1174 0.1026 0.1133 0.0938 0.1055 0.0956 0.0916 0.0662 0.0912 0.0769 0.1008
va: 2.2054 2.2947 2.0147 5.4143 2.1036 2.0983 3.8607 3.9365 3.9258 3.8747 3.9781 3.8605 3.8674 3.9192 3.8853 1.0099 1.0102 1.0201 1.0133 1.0003 1.0045 1.0122 1.0034 1.0042 0.9981 1.0343 1.0039 0.9997 1.0121 0.9905 1.0091 1.0046 1.0230 1.0035 1.0197 1.0115
dispcorr: -0.019101555 hartree
energy: -2042.217990432118
dipole: 9.76633 -9.96201 -0.19567 -11.08703 10.87608 -0.21094 -0.31960 1.03070 0.71110
magnitude: 0.76710 au
magnitude: 1.94982 debye
