program: Orca
programVersion: 5.0.2
elementType: S S S P O O C C C C C C C C C H H H H H H H H H H H H H H H H H H H H H
charge: 0
multiplicity: 1
keywords: wb97x-d3
keywords: def2-TZVPP
keywords: def2/J RIJCOSX
keywords: DEFGRID2
keywords: scfconv7
keywords: smallprint printgap noloewdin
keywords: NOSOSCF
formula: C9H21O2PS3
InChI: InChI=1/C9H21O2PS3/c1-6-10-12(13,11-7-2)15-8-14-9(3,4)5/h6-8H2,1-5H3
36 atoms
S  2.999436 0.267155 0.658674
S  0.02338 0.462496 0.956573
S  -1.063731 -0.268464 -2.181943
P  -1.51214 0.477506 -0.463445
O  -2.698839 -0.21783 0.356274
O  -2.027105 1.981251 -0.601848
C  3.204168 -1.387727 -0.134163
C  3.477228 -1.230697 -1.622974
C  4.426773 -1.974819 0.563813
C  1.990067 -2.274454 0.09796
C  1.48534 0.911485 -0.057397
C  -2.940368 -1.638749 0.375341
C  -2.461625 2.780661 0.520141
C  -2.210081 -2.327366 1.50073
C  -3.964223 2.892701 0.5536
H  4.344284 -0.596219 -1.808508
H  3.67469 -2.210069 -2.066914
H  2.624931 -0.806663 -2.15668
H  4.644059 -2.95883 0.144066
H  4.262901 -2.101187 1.634789
H  5.314664 -1.355603 0.424327
H  1.765381 -2.383205 1.159136
H  1.100333 -1.893062 -0.403809
H  2.188682 -3.270353 -0.306813
H  1.569412 1.996644 -0.089329
H  1.338521 0.55411 -1.077089
H  -4.018044 -1.738517 0.493808
H  -2.669349 -2.067735 -0.59114
H  -2.076203 2.375513 1.458826
H  -2.002658 3.758984 0.379285
H  -2.449581 -1.883698 2.466666
H  -2.517448 -3.373414 1.530357
H  -1.129658 -2.304865 1.364971
H  -4.354573 3.309915 -0.374596
H  -4.44319 1.930951 0.732987
H  -4.250863 3.562987 1.365026
elementType: S P O C H
totalener: -2042.19875177 hartree
nucrepener: 1698.22860482 hartree
electener: -3740.42735659 hartree
oneelecener: -6191.53049110 hartree
twoeener: 2451.10313451 hartree
cpcmener: -0.01639963 hartree
kineticenergy: 2036.95333055 hartree
xcener: -124.856407869917 hartree
chargesum: -0.0000000
charge: -0.168220 -0.178223 -0.446054 0.651169 -0.338528 -0.350420 0.187238 -0.319681 -0.288028 -0.306633 -0.102829 0.037393 0.045945 -0.232565 -0.248780 0.097938 0.100006 0.099533 0.097738 0.104572 0.104706 0.098963 0.060113 0.105043 0.162143 0.112947 0.103938 0.087229 0.091522 0.106405 0.093806 0.098141 0.068222 0.088419 0.083591 0.093240
qa: -0.1682 -0.1782 -0.4461 0.6512 -0.3385 -0.3504 0.1872 -0.3197 -0.2880 -0.3066 -0.1028 0.0374 0.0459 -0.2326 -0.2488 0.0979 0.1000 0.0995 0.0977 0.1046 0.1047 0.0990 0.0601 0.1050 0.1621 0.1129 0.1039 0.0872 0.0915 0.1064 0.0938 0.0981 0.0682 0.0884 0.0836 0.0932
va: 2.2350 2.2802 2.0061 5.4347 2.0992 2.1143 3.8838 3.9443 3.8605 3.9081 3.9664 3.8623 3.8502 3.9101 3.9402 1.0144 1.0032 1.0008 1.0040 1.0119 1.0102 1.0115 1.0328 1.0095 1.0008 1.0517 0.9902 1.0157 1.0069 0.9926 1.0044 1.0119 1.0071 1.0038 1.0128 1.0072
dispcorr: -0.018017975 hartree
energy: -2042.216769749270
dipole: 5.29838 -5.71995 -0.42157 -10.84859 10.50633 -0.34226 5.12780 -3.98881 1.13899
magnitude: 1.26181 au
magnitude: 3.20727 debye
