program: Orca
programVersion: 5.0.2
elementType: S S S P O O C C C C C C C C C H H H H H H H H H H H H H H H H H H H H H
charge: 0
multiplicity: 1
keywords: wb97x-d3
keywords: def2-TZVPP
keywords: def2/J RIJCOSX
keywords: DEFGRID2
keywords: scfconv7
keywords: smallprint printgap noloewdin
keywords: NOSOSCF
formula: C9H21O2PS3
InChI: InChI=1/C9H21O2PS3/c1-6-10-12(13,11-7-2)15-8-14-9(3,4)5/h6-8H2,1-5H3
36 atoms
S  2.098845 -0.022495 -0.92253
S  -0.149597 -0.764172 1.046067
S  -1.524339 0.44341 -1.824025
P  -1.719455 0.237975 0.083141
O  -3.0344 -0.486767 0.635708
O  -1.924257 1.582791 0.922023
C  3.602077 -0.320069 0.105124
C  3.276078 -0.308399 1.591593
C  4.255771 -1.635942 -0.295537
C  4.52029 0.849831 -0.237073
C  0.935383 -1.257233 -0.340605
C  -3.265073 -1.904734 0.599965
C  -1.349597 2.844014 0.536421
C  -3.528376 -2.44088 -0.786272
C  0.101571 2.967687 0.931055
H  2.650324 -1.152376 1.886682
H  4.202537 -0.386851 2.166672
H  2.773033 0.611079 1.891754
H  4.525305 -1.642732 -1.351825
H  3.606373 -2.493063 -0.108276
H  5.167758 -1.792881 0.285731
H  4.084225 1.805807 0.05762
H  5.468069 0.738207 0.294046
H  4.746547 0.894092 -1.304371
H  0.309501 -1.55187 -1.181259
H  1.451551 -2.154598 0.001724
H  -2.422899 -2.42382 1.063544
H  -4.134694 -2.053433 1.238398
H  -1.476984 2.991277 -0.538139
H  -1.955425 3.59111 1.04733
H  -3.842749 -3.481728 -0.700944
H  -4.325897 -1.890828 -1.285871
H  -2.641379 -2.41371 -1.417483
H  0.245862 2.780276 1.995536
H  0.740941 2.285976 0.368924
H  0.435946 3.985166 0.722749
elementType: S P O C H
totalener: -2042.19546328 hartree
nucrepener: 1716.40613758 hartree
electener: -3758.60160086 hartree
oneelecener: -6228.26963620 hartree
twoeener: 2469.66803535 hartree
cpcmener: -0.01781902 hartree
kineticenergy: 2036.96417347 hartree
xcener: -124.861528079332 hartree
chargesum: -0.0000000
charge: -0.171165 -0.169846 -0.445894 0.647421 -0.342635 -0.348471 0.207109 -0.328279 -0.320715 -0.296691 -0.128262 0.025772 0.037128 -0.237605 -0.233190 0.085769 0.106289 0.103612 0.096245 0.100789 0.098084 0.106180 0.098104 0.104189 0.148462 0.154252 0.093095 0.107834 0.090944 0.106752 0.097959 0.089023 0.076599 0.086712 0.055900 0.098530
qa: -0.1712 -0.1698 -0.4459 0.6474 -0.3426 -0.3485 0.2071 -0.3283 -0.3207 -0.2967 -0.1283 0.0258 0.0371 -0.2376 -0.2332 0.0858 0.1063 0.1036 0.0962 0.1008 0.0981 0.1062 0.0981 0.1042 0.1485 0.1543 0.0931 0.1078 0.0909 0.1068 0.0980 0.0890 0.0766 0.0867 0.0559 0.0985
va: 2.2480 2.2898 2.0003 5.4258 2.1195 2.1149 3.8362 3.9347 3.9421 3.8852 3.9770 3.8640 3.8659 3.8937 3.8767 1.0003 1.0071 1.0058 1.0142 1.0036 1.0034 1.0066 1.0041 1.0089 1.0275 1.0057 1.0110 0.9905 1.0154 0.9914 1.0103 1.0079 1.0141 1.0078 1.0414 1.0140
dispcorr: -0.017955469 hartree
energy: -2042.213418749112
dipole: 19.62100 -18.50486 1.11614 -3.42543 2.42421 -1.00123 4.59005 -3.44876 1.14129
magnitude: 1.88434 au
magnitude: 4.78962 debye
