program: Orca
programVersion: 5.0.2
elementType: S S S P O O C C C C C C C C C H H H H H H H H H H H H H H H H H H H H H
charge: 0
multiplicity: 1
keywords: wb97x-d3
keywords: def2-TZVPP
keywords: def2/J RIJCOSX
keywords: DEFGRID2
keywords: scfconv7
keywords: smallprint printgap noloewdin
keywords: NOSOSCF
formula: C9H21O2PS3
InChI: InChI=1/C9H21O2PS3/c1-6-10-12(13,11-7-2)15-8-14-9(3,4)5/h6-8H2,1-5H3
36 atoms
S  1.975052 -0.790362 -0.999846
S  0.34684 0.735174 1.136958
S  -1.449737 0.66223 -1.749341
P  -1.515906 0.607167 0.175345
O  -2.272914 -0.626373 0.848166
O  -2.359372 1.743082 0.923945
C  3.433376 -1.346858 -0.014874
C  3.142523 -1.335369 1.478905
C  3.676435 -2.77709 -0.487881
C  4.640308 -0.475808 -0.335552
C  1.529795 0.780003 -0.256578
C  -2.387809 -1.920197 0.228807
C  -2.067765 3.135688 0.70036
C  -1.153052 -2.763758 0.420964
C  -3.124263 3.767424 -0.170949
H  3.99513 -1.758682 2.01639
H  2.995966 -0.326157 1.866582
H  2.26237 -1.927665 1.729492
H  3.851663 -2.828464 -1.564344
H  2.836122 -3.430645 -0.248473
H  4.562543 -3.180365 0.007301
H  4.481225 0.567143 -0.055587
H  5.513998 -0.827355 0.219201
H  4.883183 -0.505144 -1.398153
H  2.408952 1.292427 0.134722
H  1.115159 1.412698 -1.0395
H  -3.252676 -2.379331 0.706238
H  -2.618658 -1.798831 -0.8316
H  -2.040482 3.600349 1.686296
H  -1.075673 3.261643 0.25789
H  -1.33688 -3.755322 0.004338
H  -0.286043 -2.344056 -0.090532
H  -0.908592 -2.884656 1.476815
H  -3.145614 3.317817 -1.163718
H  -4.11621 3.680135 0.272944
H  -2.903262 4.829472 -0.288078
elementType: S P O C H
totalener: -2042.19746686 hartree
nucrepener: 1708.94964216 hartree
electener: -3751.14710901 hartree
oneelecener: -6213.39687622 hartree
twoeener: 2462.24976720 hartree
cpcmener: -0.01723079 hartree
kineticenergy: 2036.96014853 hartree
xcener: -124.858769235792 hartree
chargesum: -0.0000000
charge: -0.170332 -0.170691 -0.445513 0.653599 -0.346413 -0.347751 0.203020 -0.325983 -0.296530 -0.318949 -0.131305 0.041272 0.049038 -0.236462 -0.238535 0.106645 0.085592 0.101783 0.104571 0.105908 0.098404 0.099659 0.098752 0.096414 0.153419 0.150464 0.106635 0.090932 0.106911 0.075832 0.097834 0.057148 0.088822 0.073617 0.090301 0.091890
qa: -0.1703 -0.1707 -0.4455 0.6536 -0.3464 -0.3478 0.2030 -0.3260 -0.2965 -0.3189 -0.1313 0.0413 0.0490 -0.2365 -0.2385 0.1066 0.0856 0.1018 0.1046 0.1059 0.0984 0.0997 0.0988 0.0964 0.1534 0.1505 0.1066 0.0909 0.1069 0.0758 0.0978 0.0571 0.0888 0.0736 0.0903 0.0919
va: 2.2489 2.2833 2.0041 5.4206 2.1148 2.1011 3.8404 3.9356 3.8849 3.9400 3.9759 3.8616 3.8708 3.8817 3.9453 1.0066 1.0002 1.0079 1.0085 1.0066 1.0040 1.0041 1.0034 1.0141 1.0052 1.0285 0.9919 1.0137 0.9930 1.0076 1.0143 1.0448 1.0069 1.0199 1.0036 1.0074
dispcorr: -0.017716537 hartree
energy: -2042.215183394149
dipole: 16.33800 -15.07099 1.26701 -7.12317 7.24410 0.12093 3.08683 -2.18005 0.90678
magnitude: 1.56276 au
magnitude: 3.97221 debye
