program: Orca
programVersion: 5.0.2
elementType: S S S P O O C C C C C C C C C H H H H H H H H H H H H H H H H H H H H H
charge: 0
multiplicity: 1
keywords: wb97x-d3
keywords: def2-TZVPP
keywords: def2/J RIJCOSX
keywords: DEFGRID2
keywords: scfconv7
keywords: smallprint printgap noloewdin
keywords: NOSOSCF
formula: C9H21O2PS3
InChI: InChI=1/C9H21O2PS3/c1-6-10-12(13,11-7-2)15-8-14-9(3,4)5/h6-8H2,1-5H3
36 atoms
S  2.033558 -0.988732 -0.886305
S  0.241705 0.169773 1.351739
S  -1.276332 0.419738 -1.702734
P  -1.473028 0.442079 0.214111
O  -2.464816 -0.646336 0.833247
O  -2.028148 1.792641 0.871276
C  3.720434 -0.860419 -0.147986
C  4.60657 -0.512711 -1.341733
C  3.783671 0.247224 0.893028
C  4.153111 -2.191848 0.449512
C  0.972227 -1.296664 0.529051
C  -3.648432 -1.091935 0.136251
C  -1.64537 3.094302 0.383826
C  -3.408218 -2.431271 -0.511623
C  -2.751124 3.693915 -0.448254
H  5.646263 -0.432862 -1.017505
H  4.563094 -1.280798 -2.116411
H  4.325698 0.440734 -1.791992
H  3.182972 0.020727 1.775676
H  3.446351 1.20158 0.488165
H  4.8145 0.372656 1.234702
H  3.519798 -2.499815 1.283217
H  4.139404 -2.987427 -0.296016
H  5.171905 -2.112157 0.83782
H  0.166869 -1.96132 0.217439
H  1.513013 -1.824805 1.313812
H  -4.427448 -1.155906 0.895808
H  -3.965156 -0.350464 -0.599982
H  -1.448252 3.697999 1.269667
H  -0.715545 3.035575 -0.186673
H  -3.095134 -3.177006 0.219821
H  -4.334135 -2.781283 -0.969835
H  -2.649908 -2.366485 -1.291805
H  -2.466592 4.701411 -0.754751
H  -2.935419 3.107733 -1.348397
H  -3.680244 3.767488 0.117833
elementType: S P O C H
totalener: -2042.19788688 hartree
nucrepener: 1686.35989095 hartree
electener: -3728.55777783 hartree
oneelecener: -6168.46812642 hartree
twoeener: 2439.91034859 hartree
cpcmener: -0.01870683 hartree
kineticenergy: 2036.95583435 hartree
xcener: -124.854288241421 hartree
chargesum: 0.0000000
charge: -0.165963 -0.151896 -0.449816 0.653933 -0.349091 -0.360424 0.193095 -0.287408 -0.322197 -0.325463 -0.148431 0.053565 0.046763 -0.245996 -0.237236 0.097164 0.103201 0.104738 0.085278 0.100802 0.103282 0.101150 0.096675 0.098556 0.148323 0.153725 0.105282 0.084483 0.107291 0.084172 0.089122 0.097909 0.077657 0.093018 0.075904 0.088835
qa: -0.1660 -0.1519 -0.4498 0.6539 -0.3491 -0.3604 0.1931 -0.2874 -0.3222 -0.3255 -0.1484 0.0536 0.0468 -0.2460 -0.2372 0.0972 0.1032 0.1047 0.0853 0.1008 0.1033 0.1011 0.0967 0.0986 0.1483 0.1537 0.1053 0.0845 0.1073 0.0842 0.0891 0.0979 0.0777 0.0930 0.0759 0.0888
va: 2.2504 2.3056 1.9857 5.4339 2.0883 2.0853 3.8710 3.8557 3.9283 3.9392 4.0446 3.8495 3.8444 3.9193 3.9370 1.0043 1.0116 1.0120 1.0001 1.0152 1.0067 1.0030 1.0139 1.0034 1.0122 1.0087 0.9963 1.0134 0.9943 1.0138 1.0034 1.0096 1.0180 1.0087 1.0195 1.0038
dispcorr: -0.016602091 hartree
energy: -2042.214488971073
dipole: 11.66273 -11.41946 0.24327 -2.81849 2.67701 -0.14148 -0.33801 1.32515 0.98714
magnitude: 1.02647 au
magnitude: 2.60909 debye
