program: Orca
programVersion: 5.0.2
elementType: S S S P O O C C C C C C C C C H H H H H H H H H H H H H H H H H H H H H
charge: 0
multiplicity: 1
keywords: wb97x-d3
keywords: def2-TZVPP
keywords: def2/J RIJCOSX
keywords: DEFGRID2
keywords: scfconv7
keywords: smallprint printgap noloewdin
keywords: NOSOSCF
formula: C9H21O2PS3
InChI: InChI=1/C9H21O2PS3/c1-6-10-12(13,11-7-2)15-8-14-9(3,4)5/h6-8H2,1-5H3
36 atoms
S  2.148828 -0.101659 1.151815
S  0.249717 -0.650906 -1.227796
S  -2.619468 0.804852 -1.857358
P  -1.454052 0.219766 -0.438537
O  -2.076044 -0.819594 0.614338
O  -0.8606 1.316292 0.555899
C  3.813741 -0.34804 0.395738
C  4.366704 -1.718764 0.759829
C  3.763511 -0.167437 -1.114254
C  4.668894 0.745366 1.029082
C  1.107577 -1.269013 0.273274
C  -3.077236 -1.788205 0.249077
C  -1.734984 2.174284 1.323484
C  -4.445695 -1.313177 0.665649
C  -1.790803 3.553615 0.718663
H  5.371953 -1.837917 0.347344
H  4.429733 -1.850212 1.840349
H  3.759183 -2.53091 0.356496
H  3.33035 0.793042 -1.393335
H  3.191426 -0.955662 -1.606609
H  4.776628 -0.210628 -1.522467
H  4.701074 0.657862 2.116858
H  5.694728 0.666024 0.663467
H  4.303409 1.742485 0.779055
H  1.686359 -2.128802 -0.064613
H  0.363466 -1.658101 0.96674
H  -3.041797 -1.9924 -0.823048
H  -2.804211 -2.706044 0.768924
H  -2.735096 1.742473 1.403074
H  -1.311907 2.200855 2.326975
H  -5.179625 -2.092553 0.458565
H  -4.482757 -1.096314 1.733706
H  -4.741292 -0.418817 0.117559
H  -2.39931 4.198288 1.353864
H  -0.799314 3.99893 0.644584
H  -2.240777 3.537522 -0.272825
elementType: S P O C H
totalener: -2042.19989792 hartree
nucrepener: 1685.86012635 hartree
electener: -3728.06002427 hartree
oneelecener: -6167.19106870 hartree
twoeener: 2439.13104443 hartree
cpcmener: -0.01948044 hartree
kineticenergy: 2036.95772213 hartree
xcener: -124.854395412626 hartree
chargesum: -0.0000000
charge: -0.170467 -0.143197 -0.456199 0.631472 -0.347757 -0.329576 0.189063 -0.322045 -0.323753 -0.287399 -0.160881 0.056014 0.035351 -0.241580 -0.231637 0.098996 0.096084 0.100281 0.102221 0.086193 0.103728 0.103441 0.097117 0.104522 0.153745 0.159735 0.084129 0.103854 0.088061 0.102911 0.097365 0.088484 0.077002 0.091352 0.089025 0.074343
qa: -0.1705 -0.1432 -0.4562 0.6315 -0.3478 -0.3296 0.1891 -0.3220 -0.3238 -0.2874 -0.1609 0.0560 0.0354 -0.2416 -0.2316 0.0990 0.0961 0.1003 0.1022 0.0862 0.1037 0.1034 0.0971 0.1045 0.1537 0.1597 0.0841 0.1039 0.0881 0.1029 0.0974 0.0885 0.0770 0.0914 0.0890 0.0743
va: 2.2405 2.3181 1.9931 5.4388 2.0545 2.0990 3.8692 3.9405 3.9277 3.8602 4.0278 3.8338 3.8980 3.9232 3.9238 1.0031 1.0142 1.0037 1.0148 0.9993 1.0069 1.0106 1.0044 1.0124 1.0057 1.0139 1.0166 0.9942 0.9968 0.9944 1.0103 1.0039 1.0197 1.0085 1.0046 1.0213
dispcorr: -0.016978227 hartree
energy: -2042.216876143368
dipole: 12.85567 -12.16749 0.68818 -1.10451 -0.07197 -1.17649 9.69881 -8.25136 1.44745
magnitude: 1.98817 au
magnitude: 5.05353 debye
