program: Orca
programVersion: 5.0.2
elementType: S S S P O O C C C C C C C C C H H H H H H H H H H H H H H H H H H H H H
charge: 0
multiplicity: 1
keywords: wb97x-d3
keywords: def2-TZVPP
keywords: def2/J RIJCOSX
keywords: DEFGRID2
keywords: scfconv7
keywords: smallprint printgap noloewdin
keywords: NOSOSCF
formula: C9H21O2PS3
InChI: InChI=1/C9H21O2PS3/c1-6-10-12(13,11-7-2)15-8-14-9(3,4)5/h6-8H2,1-5H3
36 atoms
S  2.767912 -1.561111 -0.490295
S  0.211736 -0.296532 -1.385801
S  -2.847013 0.99161 -1.674999
P  -1.601854 0.145135 -0.47266
O  -2.004004 -1.280272 0.128529
O  -1.244462 0.973048 0.857764
C  3.566066 -0.313655 0.613268
C  5.037472 -0.349175 0.212528
C  2.985762 1.072507 0.381833
C  3.411729 -0.730574 2.06999
C  1.015396 -1.380299 -0.133949
C  -3.342726 -1.590597 0.566851
C  -1.403599 2.399612 0.957154
C  -3.726353 -0.90597 1.85623
C  -0.402709 3.176738 0.136433
H  5.600117 0.346705 0.83845
H  5.475064 -1.339838 0.350777
H  5.18424 -0.052889 -0.827141
H  3.519444 1.800893 0.997738
H  1.933313 1.1233 0.660624
H  3.076083 1.381612 -0.659648
H  2.36642 -0.76958 2.381222
H  3.855132 -1.709229 2.256015
H  3.911047 -0.006007 2.718413
H  0.561481 -2.367354 -0.191123
H  0.857556 -0.988723 0.870094
H  -4.046497 -1.345515 -0.2316
H  -3.343332 -2.672425 0.691536
H  -2.423524 2.669118 0.676314
H  -1.282515 2.616293 2.017894
H  -4.684326 -1.308314 2.188953
H  -2.997217 -1.090907 2.645202
H  -3.850306 0.170424 1.736946
H  0.624605 2.930406 0.403599
H  -0.533647 3.013233 -0.93335
H  -0.548503 4.24127 0.325031
elementType: S P O C H
totalener: -2042.19882805 hartree
nucrepener: 1697.27261512 hartree
electener: -3739.47144316 hartree
oneelecener: -6189.41662572 hartree
twoeener: 2449.94518256 hartree
cpcmener: -0.01808854 hartree
kineticenergy: 2036.94365951 hartree
xcener: -124.854007832176 hartree
chargesum: 0.0000000
charge: -0.170216 -0.151516 -0.453559 0.641360 -0.343183 -0.352218 0.197021 -0.292378 -0.317354 -0.322760 -0.126755 0.023242 0.048866 -0.236660 -0.261002 0.097990 0.105823 0.105105 0.106566 0.059876 0.104535 0.102998 0.097920 0.100315 0.155431 0.130913 0.089499 0.105234 0.096305 0.109299 0.098787 0.089493 0.079450 0.098783 0.077221 0.105569
qa: -0.1702 -0.1515 -0.4536 0.6414 -0.3432 -0.3522 0.1970 -0.2924 -0.3174 -0.3228 -0.1268 0.0232 0.0489 -0.2367 -0.2610 0.0980 0.1058 0.1051 0.1066 0.0599 0.1045 0.1030 0.0979 0.1003 0.1554 0.1309 0.0895 0.1052 0.0963 0.1093 0.0988 0.0895 0.0795 0.0988 0.0772 0.1056
va: 2.2357 2.2967 2.0028 5.3959 2.1016 2.0455 3.8864 3.8684 3.9203 3.9467 4.0124 3.8820 3.8118 3.8954 3.9231 1.0037 1.0093 1.0118 1.0070 1.0160 1.0116 1.0010 1.0125 1.0030 1.0076 1.0263 1.0104 0.9897 1.0147 0.9926 1.0093 1.0064 1.0127 0.9944 1.0213 1.0121
dispcorr: -0.018301769 hartree
energy: -2042.217129818536
dipole: 13.69779 -13.22366 0.47413 6.44324 -6.17586 0.26739 19.17324 -16.61933 2.55390
magnitude: 2.61127 au
magnitude: 6.63732 debye
