program: Orca
programVersion: 5.0.2
elementType: S S S P O O C C C C C C C C C H H H H H H H H H H H H H H H H H H H H H
charge: 0
multiplicity: 1
keywords: wb97x-d3
keywords: def2-TZVPP
keywords: def2/J RIJCOSX
keywords: DEFGRID2
keywords: scfconv7
keywords: smallprint printgap noloewdin
keywords: NOSOSCF
formula: C9H21O2PS3
InChI: InChI=1/C9H21O2PS3/c1-6-10-12(13,11-7-2)15-8-14-9(3,4)5/h6-8H2,1-5H3
36 atoms
S  2.578631 -1.692199 -0.010823
S  0.025177 -0.4745 -1.054292
S  -2.804595 1.163906 -1.416788
P  -1.658939 0.317147 -0.121681
O  -2.258529 -0.875229 0.761503
O  -1.152149 1.207701 1.106193
C  3.490899 -0.120519 0.33186
C  4.946297 -0.57123 0.431818
C  3.332795 0.865033 -0.818263
C  3.046408 0.501527 1.646318
C  0.854698 -1.343429 0.338732
C  -2.913938 -1.99457 0.132511
C  -1.052467 2.642763 1.038832
C  -4.407415 -1.898246 0.315709
C  0.084324 3.122992 0.171008
H  5.586276 0.30112 0.580022
H  5.106299 -1.249439 1.270996
H  5.283286 -1.070476 -0.478997
H  2.300267 1.189108 -0.940081
H  3.662469 0.432033 -1.763318
H  3.938578 1.75502 -0.627679
H  2.024169 0.880188 1.605716
H  3.117277 -0.204436 2.474838
H  3.688621 1.354457 1.878666
H  0.375299 -2.311449 0.47804
H  0.74204 -0.777627 1.261134
H  -2.653276 -2.052524 -0.92763
H  -2.51531 -2.887087 0.61435
H  -2.004015 3.054239 0.696985
H  -0.906643 2.954291 2.07222
H  -4.677219 -1.851837 1.371192
H  -4.815981 -1.022524 -0.188178
H  -4.880376 -2.783712 -0.110695
H  1.042728 2.718613 0.496457
H  -0.064282 2.872275 -0.879321
H  0.14095 4.210154 0.243535
elementType: S P O C H
totalener: -2042.19944255 hartree
nucrepener: 1703.91520843 hartree
electener: -3746.11465097 hartree
oneelecener: -6202.51623100 hartree
twoeener: 2456.40158002 hartree
cpcmener: -0.01778863 hartree
kineticenergy: 2036.95320214 hartree
xcener: -124.857190953342 hartree
chargesum: 0.0000000
charge: -0.161092 -0.152148 -0.448733 0.628651 -0.345585 -0.348814 0.200325 -0.289074 -0.323885 -0.330198 -0.141455 0.042318 0.039470 -0.232165 -0.258422 0.097928 0.103199 0.105697 0.076730 0.102247 0.103085 0.075341 0.110946 0.107704 0.157625 0.142241 0.085162 0.105489 0.102120 0.111372 0.088849 0.074615 0.091921 0.088099 0.081548 0.108887
qa: -0.1611 -0.1521 -0.4487 0.6287 -0.3456 -0.3488 0.2003 -0.2891 -0.3239 -0.3302 -0.1415 0.0423 0.0395 -0.2322 -0.2584 0.0979 0.1032 0.1057 0.0767 0.1022 0.1031 0.0753 0.1109 0.1077 0.1576 0.1422 0.0852 0.1055 0.1021 0.1114 0.0888 0.0746 0.0919 0.0881 0.0815 0.1089
va: 2.2546 2.2895 2.0092 5.4498 2.0882 2.0863 3.8424 3.8675 3.9261 3.9244 4.0418 3.8512 3.8166 3.9525 3.9099 1.0038 1.0137 1.0082 1.0222 1.0167 1.0032 1.0135 1.0131 1.0023 0.9982 1.0134 1.0080 0.9919 1.0152 0.9932 1.0041 1.0194 1.0078 0.9956 1.0154 1.0131
dispcorr: -0.018924269 hartree
energy: -2042.218366813754
dipole: 15.62588 -14.62047 1.00541 4.72444 -4.65495 0.06949 8.84716 -7.39202 1.45514
magnitude: 1.77006 au
magnitude: 4.49914 debye
