program: Orca
programVersion: 5.0.2
elementType: S S S P O O C C C C C C C C C H H H H H H H H H H H H H H H H H H H H H
charge: 0
multiplicity: 1
keywords: wb97x-d3
keywords: def2-TZVPP
keywords: def2/J RIJCOSX
keywords: DEFGRID2
keywords: scfconv7
keywords: smallprint printgap noloewdin
keywords: NOSOSCF
formula: C9H21O2PS3
InChI: InChI=1/C9H21O2PS3/c1-6-10-12(13,11-7-2)15-8-14-9(3,4)5/h6-8H2,1-5H3
36 atoms
S  2.920748 0.175555 -0.582363
S  -0.012584 0.127187 -1.179064
S  -3.319554 0.228556 -1.075147
P  -1.719536 0.41876 -0.021338
O  -1.566969 -0.54439 1.250629
O  -1.492494 1.80172 0.75242
C  3.20955 -1.251507 0.553618
C  3.404005 -0.748655 1.977825
C  2.063957 -2.248296 0.485673
C  4.497322 -1.884981 0.03796
C  1.307511 0.787374 -0.080094
C  -2.273097 -1.795883 1.35693
C  -1.961932 3.06336 0.239218
C  -1.794325 -2.852331 0.390628
C  -1.208459 3.546079 -0.97637
H  2.5177 -0.239821 2.360967
H  3.601725 -1.590955 2.645591
H  4.245264 -0.05876 2.048829
H  1.892844 -2.601071 -0.531339
H  1.132973 -1.823011 0.859936
H  2.296051 -3.115249 1.109584
H  4.385237 -2.262784 -0.97934
H  5.332397 -1.1819 0.051178
H  4.769576 -2.727692 0.676866
H  1.103227 0.53795 0.960096
H  1.318361 1.871413 -0.172775
H  -2.108034 -2.1137 2.385475
H  -3.342234 -1.614389 1.231378
H  -3.030324 2.987627 0.026821
H  -1.83513 3.756968 1.069123
H  -0.731803 -3.063038 0.505495
H  -2.339585 -3.775722 0.591861
H  -1.986301 -2.580536 -0.647269
H  -1.55602 4.551207 -1.219758
H  -0.134921 3.603697 -0.794745
H  -1.383749 2.918913 -1.850194
elementType: S P O C H
totalener: -2042.19728511 hartree
nucrepener: 1709.46932305 hartree
electener: -3751.66660817 hartree
oneelecener: -6213.75570525 hartree
twoeener: 2462.08909708 hartree
cpcmener: -0.01793295 hartree
kineticenergy: 2036.95585207 hartree
xcener: -124.858488926068 hartree
chargesum: -0.0000000
charge: -0.171616 -0.148873 -0.451361 0.638343 -0.354507 -0.351851 0.201867 -0.323841 -0.323272 -0.292297 -0.131279 0.037031 0.037967 -0.260527 -0.260315 0.103265 0.099613 0.097877 0.104359 0.062906 0.107292 0.104818 0.105560 0.098081 0.129368 0.162348 0.110781 0.100707 0.094885 0.108537 0.096244 0.105627 0.080267 0.106440 0.091989 0.083564
qa: -0.1716 -0.1489 -0.4514 0.6383 -0.3545 -0.3519 0.2019 -0.3238 -0.3233 -0.2923 -0.1313 0.0370 0.0380 -0.2605 -0.2603 0.1033 0.0996 0.0979 0.1044 0.0629 0.1073 0.1048 0.1056 0.0981 0.1294 0.1623 0.1108 0.1007 0.0949 0.1085 0.0962 0.1056 0.0803 0.1064 0.0920 0.0836
va: 2.2368 2.2798 2.0051 5.4169 2.0796 2.0984 3.8868 3.9507 3.9177 3.8679 4.0140 3.8246 3.8500 3.9036 3.8975 1.0003 1.0031 1.0124 1.0116 1.0167 1.0070 1.0118 1.0094 1.0036 1.0270 0.9988 0.9941 1.0146 1.0117 0.9912 0.9965 1.0114 1.0211 1.0118 1.0014 1.0168
dispcorr: -0.018814621 hartree
energy: -2042.216099733473
dipole: 15.69391 -14.72899 0.96493 -8.42194 8.27996 -0.14198 9.90303 -8.26490 1.63813
magnitude: 1.90649 au
magnitude: 4.84592 debye
