program: Orca
programVersion: 5.0.2
elementType: S S S P O O C C C C C C C C C H H H H H H H H H H H H H H H H H H H H H
charge: 0
multiplicity: 1
keywords: wb97x-d3
keywords: def2-TZVPP
keywords: def2/J RIJCOSX
keywords: DEFGRID2
keywords: scfconv7
keywords: smallprint printgap noloewdin
keywords: NOSOSCF
formula: C9H21O2PS3
InChI: InChI=1/C9H21O2PS3/c1-6-10-12(13,11-7-2)15-8-14-9(3,4)5/h6-8H2,1-5H3
36 atoms
S  2.348917 -0.308431 -0.946504
S  0.209404 -0.077533 1.262017
S  -1.0628 0.749641 -1.803903
P  -1.348673 0.661766 0.098946
O  -2.558646 -0.254915 0.610009
O  -1.695549 2.049235 0.813627
C  3.659194 -1.313511 -0.124469
C  4.798576 -0.42178 0.349518
C  3.092131 -2.126004 1.031267
C  4.14859 -2.245092 -1.229782
C  1.654179 0.653923 0.398438
C  -2.742737 -1.606206 0.147626
C  -2.442127 3.090321 0.151151
C  -4.163889 -2.014527 0.436173
C  -3.903282 2.750926 -0.013522
H  4.479389 0.283942 1.11847
H  5.593051 -1.032252 0.786919
H  5.228855 0.149533 -0.4734
H  2.253555 -2.747847 0.717325
H  2.758363 -1.496089 1.857715
H  3.867951 -2.784619 1.430474
H  4.536698 -1.691331 -2.086829
H  4.958714 -2.871522 -0.850273
H  3.355747 -2.905957 -1.583444
H  2.396542 0.829223 1.176716
H  1.375557 1.634225 0.015001
H  -2.53219 -1.663581 -0.922877
H  -2.034769 -2.257391 0.66541
H  -2.316312 3.964484 0.788313
H  -1.979662 3.309361 -0.813359
H  -4.876179 -1.392763 -0.106743
H  -4.31083 -3.047167 0.11857
H  -4.391398 -1.958048 1.501082
H  -4.05933 1.930202 -0.714294
H  -4.367052 2.491962 0.938476
H  -4.423552 3.623268 -0.411357
elementType: S P O C H
totalener: -2042.19955799 hartree
nucrepener: 1679.77641924 hartree
electener: -3721.97597722 hartree
oneelecener: -6155.28367526 hartree
twoeener: 2433.30769804 hartree
cpcmener: -0.01873497 hartree
kineticenergy: 2036.95394407 hartree
xcener: -124.853833816451 hartree
chargesum: -0.0000000
charge: -0.168861 -0.156337 -0.452503 0.657354 -0.349173 -0.348389 0.195962 -0.324067 -0.328656 -0.287366 -0.142388 0.041304 0.032362 -0.242833 -0.236704 0.100065 0.098746 0.096621 0.102783 0.086145 0.104422 0.103444 0.096919 0.104123 0.152965 0.148173 0.090415 0.097734 0.108657 0.092047 0.087351 0.088735 0.088462 0.074760 0.090700 0.097030
qa: -0.1689 -0.1563 -0.4525 0.6574 -0.3492 -0.3484 0.1960 -0.3241 -0.3287 -0.2874 -0.1424 0.0413 0.0324 -0.2428 -0.2367 0.1001 0.0987 0.0966 0.1028 0.0861 0.1044 0.1034 0.0969 0.1041 0.1530 0.1482 0.0904 0.0977 0.1087 0.0920 0.0874 0.0887 0.0885 0.0748 0.0907 0.0970
va: 2.2490 2.3062 1.9967 5.4218 2.0971 2.1015 3.8712 3.9422 3.9271 3.8585 4.0185 3.8510 3.8607 3.9596 3.8961 1.0033 1.0034 1.0140 1.0143 0.9998 1.0069 1.0111 1.0041 1.0124 1.0108 1.0188 1.0065 0.9943 0.9909 1.0144 1.0052 1.0068 1.0039 1.0201 1.0065 1.0093
dispcorr: -0.016243218 hartree
energy: -2042.215801202903
dipole: 6.73144 -6.50061 0.23083 -8.66884 8.43293 -0.23592 3.25327 -2.15406 1.09920
magnitude: 1.14769 au
magnitude: 2.91719 debye
