program: Orca
programVersion: 5.0.2
elementType: S S S P O O C C C C C C C C C H H H H H H H H H H H H H H H H H H H H H
charge: 0
multiplicity: 1
keywords: wb97x-d3
keywords: def2-TZVPP
keywords: def2/J RIJCOSX
keywords: DEFGRID2
keywords: scfconv7
keywords: smallprint printgap noloewdin
keywords: NOSOSCF
formula: C9H21O2PS3
InChI: InChI=1/C9H21O2PS3/c1-6-10-12(13,11-7-2)15-8-14-9(3,4)5/h6-8H2,1-5H3
36 atoms
S  3.001587 0.765577 0.730909
S  0.499077 0.470409 -0.902117
S  -2.533838 -0.165032 -2.075283
P  -1.487718 0.043531 -0.473274
O  -1.356387 -1.231301 0.484807
O  -1.982335 1.157683 0.573414
C  3.553293 -0.971276 0.388897
C  3.721971 -1.177274 -1.111992
C  4.909887 -1.075831 1.080715
C  2.588942 -1.992425 0.97018
C  1.211744 0.706413 0.774966
C  -2.475086 -2.0971 0.771855
C  -2.618155 2.382784 0.161088
C  -3.51661 -1.460048 1.659208
C  -1.681872 3.344813 -0.529787
H  4.116731 -2.177847 -1.307853
H  2.775963 -1.086304 -1.645087
H  4.419831 -0.455601 -1.538397
H  4.819984 -0.976931 2.162899
H  5.610311 -0.315921 0.727636
H  5.355005 -2.050051 0.866646
H  3.00734 -2.992645 0.835589
H  2.427943 -1.843807 2.038948
H  1.619904 -1.982999 0.469028
H  0.85297 -0.067295 1.450137
H  0.891463 1.673076 1.162722
H  -2.915304 -2.43614 -0.168477
H  -2.028811 -2.960837 1.262038
H  -3.472319 2.14615 -0.476637
H  -3.000383 2.816154 1.084139
H  -4.240726 -2.223759 1.945895
H  -3.077585 -1.059489 2.573086
H  -4.065641 -0.664867 1.15494
H  -2.211218 4.284596 -0.694179
H  -0.801456 3.562575 0.075614
H  -1.354986 2.979791 -1.503264
elementType: S P O C H
totalener: -2042.19874336 hartree
nucrepener: 1695.70479002 hartree
electener: -3737.90353337 hartree
oneelecener: -6186.45505060 hartree
twoeener: 2448.55151723 hartree
cpcmener: -0.01669167 hartree
kineticenergy: 2036.94543191 hartree
xcener: -124.854304789409 hartree
chargesum: -0.0000000
charge: -0.165650 -0.152408 -0.447686 0.631504 -0.337343 -0.348581 0.168623 -0.312535 -0.291780 -0.315316 -0.138819 0.022185 0.045312 -0.234820 -0.247576 0.098556 0.098805 0.097783 0.100900 0.103876 0.096522 0.106871 0.106424 0.083151 0.137598 0.158900 0.092358 0.103946 0.092831 0.107698 0.098602 0.088787 0.079536 0.103261 0.090330 0.078154
qa: -0.1657 -0.1524 -0.4477 0.6315 -0.3373 -0.3486 0.1686 -0.3125 -0.2918 -0.3153 -0.1388 0.0222 0.0453 -0.2348 -0.2476 0.0986 0.0988 0.0978 0.1009 0.1039 0.0965 0.1069 0.1064 0.0832 0.1376 0.1589 0.0924 0.1039 0.0928 0.1077 0.0986 0.0888 0.0795 0.1033 0.0903 0.0782
va: 2.2449 2.2956 2.0166 5.4055 2.1025 2.0540 3.8470 3.9323 3.8965 3.9221 4.0408 3.8771 3.8340 3.8931 3.9152 1.0037 1.0177 1.0120 1.0144 1.0060 1.0040 1.0054 1.0055 1.0185 1.0160 0.9961 1.0106 0.9898 1.0135 0.9904 1.0093 1.0071 1.0157 1.0125 1.0024 1.0166
dispcorr: -0.017932694 hartree
energy: -2042.216676052476
dipole: 8.87626 -8.99811 -0.12185 -5.57647 5.27706 -0.29942 10.92716 -9.08097 1.84620
magnitude: 1.87428 au
magnitude: 4.76405 debye
