program: Orca
programVersion: 5.0.2
elementType: S S S P O O C C C C C C C C C H H H H H H H H H H H H H H H H H H H H H
charge: 0
multiplicity: 1
keywords: wb97x-d3
keywords: def2-TZVPP
keywords: def2/J RIJCOSX
keywords: DEFGRID2
keywords: scfconv7
keywords: smallprint printgap noloewdin
keywords: NOSOSCF
formula: C9H21O2PS3
InChI: InChI=1/C9H21O2PS3/c1-6-10-12(13,11-7-2)15-8-14-9(3,4)5/h6-8H2,1-5H3
36 atoms
S  2.977349 0.587611 0.912694
S  0.525775 0.722612 -0.816694
S  -2.493391 0.424769 -2.154248
P  -1.460804 0.186384 -0.547786
O  -1.328225 -1.302933 0.022114
O  -1.964221 0.972215 0.759071
C  3.462647 -1.114965 0.368164
C  2.486203 -2.164744 0.873644
C  3.58313 -1.175839 -1.149618
C  4.834455 -1.322287 1.005536
C  1.186098 0.611499 0.895356
C  -2.432917 -2.230839 0.021901
C  -2.678574 2.220143 0.688029
C  -3.482797 -1.90775 1.056802
C  -1.808018 3.380653 0.273095
H  1.51043 -2.092022 0.391371
H  2.880128 -3.157866 0.644734
H  2.343497 -2.107408 1.95387
H  4.280423 -0.426635 -1.526144
H  2.622812 -1.020992 -1.640677
H  3.954114 -2.15892 -1.451926
H  4.777843 -1.330619 2.094532
H  5.245947 -2.280689 0.681889
H  5.545226 -0.548055 0.708648
H  0.768656 -0.251193 1.410067
H  0.893506 1.507187 1.442232
H  -2.867871 -2.271711 -0.979117
H  -1.975566 -3.197776 0.225633
H  -3.528669 2.109727 0.011699
H  -3.069683 2.370545 1.693444
H  -4.202463 -2.727012 1.090024
H  -3.049327 -1.805571 2.051802
H  -4.036432 -0.99888 0.819814
H  -2.393044 4.298595 0.345101
H  -0.93929 3.488822 0.923098
H  -1.465531 3.291255 -0.757739
elementType: S P O C H
totalener: -2042.19892696 hartree
nucrepener: 1696.74838756 hartree
electener: -3738.94731452 hartree
oneelecener: -6188.52257124 hartree
twoeener: 2449.57525673 hartree
cpcmener: -0.01679505 hartree
kineticenergy: 2036.95351003 hartree
xcener: -124.855406795457 hartree
chargesum: -0.0000000
charge: -0.162905 -0.150284 -0.448492 0.630965 -0.334680 -0.349976 0.171178 -0.314763 -0.315401 -0.290355 -0.142530 0.024384 0.046041 -0.236481 -0.248496 0.083625 0.106414 0.105821 0.098264 0.096300 0.098708 0.101176 0.096534 0.104270 0.136721 0.158469 0.091479 0.102991 0.092576 0.108737 0.098417 0.089645 0.079891 0.103014 0.091272 0.077469
qa: -0.1629 -0.1503 -0.4485 0.6310 -0.3347 -0.3500 0.1712 -0.3148 -0.3154 -0.2904 -0.1425 0.0244 0.0460 -0.2365 -0.2485 0.0836 0.1064 0.1058 0.0983 0.0963 0.0987 0.1012 0.0965 0.1043 0.1367 0.1585 0.0915 0.1030 0.0926 0.1087 0.0984 0.0896 0.0799 0.1030 0.0913 0.0775
va: 2.2495 2.2935 2.0142 5.4057 2.1035 2.0542 3.8570 3.9195 3.9227 3.8864 4.0473 3.8767 3.8319 3.8950 3.9175 1.0144 1.0049 1.0076 1.0128 1.0227 1.0043 1.0144 1.0043 1.0066 1.0170 0.9960 1.0118 0.9895 1.0135 0.9903 1.0092 1.0063 1.0147 1.0127 1.0020 1.0176
dispcorr: -0.018028662 hartree
energy: -2042.216955617017
dipole: 7.83296 -8.06684 -0.23388 -9.10043 8.28893 -0.81151 10.83391 -9.03014 1.80377
magnitude: 1.99169 au
magnitude: 5.06247 debye
