program: Orca
programVersion: 5.0.2
elementType: S S S P O O C C C C C C C C C H H H H H H H H H H H H H H H H H H H H H
charge: 0
multiplicity: 1
keywords: wb97x-d3
keywords: def2-TZVPP
keywords: def2/J RIJCOSX
keywords: DEFGRID2
keywords: scfconv7
keywords: smallprint printgap noloewdin
keywords: NOSOSCF
formula: C9H21O2PS3
InChI: InChI=1/C9H21O2PS3/c1-6-10-12(13,11-7-2)15-8-14-9(3,4)5/h6-8H2,1-5H3
36 atoms
S  1.729629 -1.4128 0.546065
S  0.257266 0.77299 1.891641
S  -0.441771 1.465087 -1.378517
P  -1.098032 0.764945 0.295001
O  -1.723498 -0.705633 0.229659
O  -2.213408 1.588801 1.090123
C  3.200044 -1.588115 -0.552608
C  3.205403 -3.066597 -0.930607
C  3.049034 -0.731065 -1.802075
C  4.47253 -1.22827 0.20156
C  1.783577 0.328649 1.025937
C  -1.693874 -1.560378 -0.926503
C  -3.597929 1.657349 0.691626
C  -2.972492 -1.441443 -1.718232
C  -3.835198 2.621297 -0.446083
H  4.047252 -3.271772 -1.594045
H  3.30868 -3.710681 -0.056267
H  2.293984 -3.352885 -1.457387
H  3.035692 0.334668 -1.573777
H  2.135644 -0.969282 -2.346784
H  3.894988 -0.904869 -2.471382
H  4.593584 -1.839606 1.096419
H  5.343532 -1.391109 -0.437793
H  4.488792 -0.179464 0.503409
H  2.583011 0.531515 1.738665
H  1.909513 0.986175 0.166031
H  -0.826248 -1.328008 -1.543945
H  -1.563191 -2.569837 -0.537777
H  -3.967857 0.659874 0.446654
H  -4.122931 1.988314 1.5868
H  -3.092096 -0.443198 -2.14046
H  -2.949074 -2.151339 -2.546067
H  -3.846547 -1.670855 -1.10876
H  -4.910323 2.733007 -0.590253
H  -3.42473 3.607087 -0.226333
H  -3.407454 2.269943 -1.383339
elementType: S P O C H
totalener: -2042.19728551 hartree
nucrepener: 1718.48311420 hartree
electener: -3760.68039971 hartree
oneelecener: -6232.52658010 hartree
twoeener: 2471.84618039 hartree
cpcmener: -0.01693386 hartree
kineticenergy: 2036.95661803 hartree
xcener: -124.859221979055 hartree
chargesum: -0.0000000
charge: -0.179802 -0.144354 -0.447429 0.639790 -0.346818 -0.345314 0.189305 -0.292051 -0.320335 -0.321306 -0.135540 0.074613 0.017134 -0.258046 -0.240127 0.097513 0.103774 0.104637 0.095173 0.095684 0.103329 0.098499 0.099693 0.097651 0.153324 0.129789 0.073804 0.107339 0.100538 0.111281 0.079606 0.103072 0.092382 0.096637 0.091483 0.075074
qa: -0.1798 -0.1444 -0.4474 0.6398 -0.3468 -0.3453 0.1893 -0.2921 -0.3203 -0.3213 -0.1355 0.0746 0.0171 -0.2580 -0.2401 0.0975 0.1038 0.1046 0.0952 0.0957 0.1033 0.0985 0.0997 0.0977 0.1533 0.1298 0.0738 0.1073 0.1005 0.1113 0.0796 0.1031 0.0924 0.0966 0.0915 0.0751
va: 2.2101 2.3200 1.9816 5.4130 2.0680 2.1188 3.8649 3.8679 3.9499 3.9229 4.0088 3.8117 3.8895 3.9528 3.9022 1.0046 1.0108 1.0095 1.0045 1.0095 1.0067 1.0126 1.0041 1.0010 0.9964 1.0248 1.0213 0.9928 0.9951 0.9894 1.0072 1.0111 1.0034 1.0098 1.0062 1.0167
dispcorr: -0.018361576 hartree
energy: -2042.215647081357
dipole: 5.96454 -6.05963 -0.09509 -10.27552 9.48171 -0.79381 -13.60162 13.01630 -0.58531
magnitude: 0.99084 au
magnitude: 2.51852 debye
