program: Orca
programVersion: 5.0.2
elementType: S S S P O O C C C C C C C C C H H H H H H H H H H H H H H H H H H H H H
charge: 0
multiplicity: 1
keywords: wb97x-d3
keywords: def2-TZVPP
keywords: def2/J RIJCOSX
keywords: DEFGRID2
keywords: scfconv7
keywords: smallprint printgap noloewdin
keywords: NOSOSCF
formula: C9H21O2PS3
InChI: InChI=1/C9H21O2PS3/c1-6-10-12(13,11-7-2)15-8-14-9(3,4)5/h6-8H2,1-5H3
36 atoms
S  2.830024 -1.473346 0.414976
S  -0.125777 -1.187257 1.132887
S  -1.166313 0.05894 -1.877459
P  -1.374826 0.07608 0.043002
O  -2.830237 -0.289236 0.603057
O  -1.124833 1.469495 0.780065
C  3.300521 0.121672 -0.384169
C  2.363349 1.250345 0.01763
C  4.707494 0.385753 0.145146
C  3.332233 -0.035768 -1.898583
C  1.129501 -1.758059 -0.080206
C  -3.508857 -1.487712 0.179527
C  -1.773075 2.684614 0.345323
C  -4.566477 -1.172549 -0.848095
C  -0.964588 3.853948 0.842832
H  2.256354 1.330611 1.099315
H  2.759048 2.199477 -0.353741
H  1.374731 1.127619 -0.422812
H  5.097314 1.303064 -0.300926
H  5.397676 -0.420838 -0.109248
H  4.717967 0.513955 1.228756
H  3.663353 0.89734 -2.361599
H  4.018361 -0.825152 -2.207088
H  2.347322 -0.262799 -2.310248
H  0.903747 -1.330154 -1.057764
H  0.99735 -2.835353 -0.162832
H  -2.793365 -2.218673 -0.207209
H  -3.950204 -1.912527 1.080667
H  -1.840786 2.697819 -0.745014
H  -2.787236 2.705569 0.748669
H  -5.290679 -0.451568 -0.467766
H  -4.129444 -0.778663 -1.76496
H  -5.105865 -2.086797 -1.098356
H  0.046213 3.843475 0.433111
H  -1.445043 4.780221 0.526266
H  -0.9007 3.867141 1.931144
elementType: S P O C H
totalener: -2042.19838610 hartree
nucrepener: 1703.16848017 hartree
electener: -3745.36686627 hartree
oneelecener: -6201.66553160 hartree
twoeener: 2456.29866533 hartree
cpcmener: -0.01514180 hartree
kineticenergy: 2036.95838972 hartree
xcener: -124.854376718186 hartree
chargesum: -0.0000000
charge: -0.168935 -0.149711 -0.449790 0.655651 -0.358312 -0.337809 0.193668 -0.305827 -0.292040 -0.317817 -0.114940 0.044475 0.030169 -0.241627 -0.241293 0.103946 0.105745 0.044922 0.097375 0.103901 0.105588 0.099914 0.097690 0.096423 0.116839 0.164441 0.079919 0.108688 0.090074 0.110458 0.088899 0.077683 0.093301 0.086116 0.092512 0.089705
qa: -0.1689 -0.1497 -0.4498 0.6557 -0.3583 -0.3378 0.1937 -0.3058 -0.2920 -0.3178 -0.1149 0.0445 0.0302 -0.2416 -0.2413 0.1039 0.1057 0.0449 0.0974 0.1039 0.1056 0.0999 0.0977 0.0964 0.1168 0.1644 0.0799 0.1087 0.0901 0.1105 0.0889 0.0777 0.0933 0.0861 0.0925 0.0897
va: 2.2268 2.3107 1.9896 5.4151 2.0961 2.0954 3.8888 3.9116 3.8665 3.9444 3.9727 3.8677 3.8463 3.9441 3.9499 1.0152 1.0091 1.0326 1.0040 1.0111 1.0108 1.0031 1.0144 1.0043 1.0602 0.9966 1.0095 0.9935 1.0084 0.9956 1.0038 1.0189 1.0083 1.0034 1.0077 1.0037
dispcorr: -0.018191566 hartree
energy: -2042.216577669401
dipole: 6.31953 -6.95710 -0.63757 11.66352 -11.12417 0.53935 -5.22542 5.06695 -0.15847
magnitude: 0.85001 au
magnitude: 2.16055 debye
