program: Orca
programVersion: 5.0.2
elementType: S S S P O O C C C C C C C C C H H H H H H H H H H H H H H H H H H H H H
charge: 0
multiplicity: 1
keywords: wb97x-d3
keywords: def2-TZVPP
keywords: def2/J RIJCOSX
keywords: DEFGRID2
keywords: scfconv7
keywords: smallprint printgap noloewdin
keywords: NOSOSCF
formula: C9H21O2PS3
InChI: InChI=1/C9H21O2PS3/c1-6-10-12(13,11-7-2)15-8-14-9(3,4)5/h6-8H2,1-5H3
36 atoms
S  3.235142 -0.072882 -0.271125
S  0.664035 1.383789 0.573325
S  -1.431624 0.45455 -1.95543
P  -1.185677 0.658028 -0.051403
O  -1.351635 -0.661883 0.831885
O  -2.187364 1.653602 0.701344
C  2.650828 -1.803266 0.008634
C  3.937823 -2.622659 -0.050308
C  2.013721 -1.945986 1.385274
C  1.696695 -2.258891 -1.083597
C  1.802292 0.873863 -0.775922
C  -2.474108 -1.556577 0.682613
C  -2.450378 2.979264 0.195736
C  -2.051132 -2.921817 1.156061
C  -3.803053 3.04033 -0.464023
H  3.711869 -3.669359 0.1644
H  4.404347 -2.576089 -1.035307
H  4.669768 -2.289827 0.688573
H  1.75015 -2.992019 1.563693
H  1.105319 -1.355183 1.480621
H  2.699683 -1.636893 2.174674
H  1.488412 -3.324343 -0.958991
H  0.737044 -1.742844 -1.047168
H  2.120939 -2.118238 -2.078727
H  2.199391 1.795064 -1.202022
H  1.227913 0.387469 -1.564697
H  -3.3056 -1.170664 1.275097
H  -2.78683 -1.588332 -0.363546
H  -2.403968 3.640802 1.060456
H  -1.66408 3.290822 -0.496273
H  -1.235896 -3.31951 0.550645
H  -1.736086 -2.90794 2.199904
H  -2.895542 -3.606736 1.072135
H  -4.001892 4.066849 -0.775274
H  -3.847146 2.406957 -1.349784
H  -4.59694 2.740959 0.220778
elementType: S P O C H
totalener: -2042.19842241 hartree
nucrepener: 1713.76942139 hartree
electener: -3755.96784381 hartree
oneelecener: -6222.71656799 hartree
twoeener: 2466.74872418 hartree
cpcmener: -0.01462503 hartree
kineticenergy: 2036.95888400 hartree
xcener: -124.855240214194 hartree
chargesum: -0.0000000
charge: -0.163338 -0.152977 -0.450455 0.651452 -0.325160 -0.363118 0.202740 -0.291238 -0.330898 -0.309598 -0.122258 0.023707 0.042883 -0.246150 -0.239138 0.096893 0.102203 0.104296 0.100193 0.080101 0.101511 0.104308 0.052705 0.110665 0.164772 0.123835 0.112956 0.091724 0.109140 0.083205 0.084374 0.091758 0.099964 0.093129 0.076519 0.089296
qa: -0.1633 -0.1530 -0.4505 0.6515 -0.3252 -0.3631 0.2027 -0.2912 -0.3309 -0.3096 -0.1223 0.0237 0.0429 -0.2461 -0.2391 0.0969 0.1022 0.1043 0.1002 0.0801 0.1015 0.1043 0.0527 0.1107 0.1648 0.1238 0.1130 0.0917 0.1091 0.0832 0.0844 0.0918 0.1000 0.0931 0.0765 0.0893
va: 2.2408 2.3085 1.9890 5.4281 2.0955 2.1011 3.8362 3.8733 3.9236 3.9110 3.9978 3.8458 3.8591 3.9381 3.9446 1.0037 1.0143 1.0081 1.0032 1.0323 1.0183 1.0053 1.0315 1.0139 0.9931 1.0463 0.9960 1.0109 0.9935 1.0110 1.0027 1.0031 1.0091 1.0080 1.0189 1.0035
dispcorr: -0.018926394 hartree
energy: -2042.217348806423
dipole: -1.23040 0.33683 -0.89358 -15.74236 15.31600 -0.42636 2.62571 -2.20956 0.41615
magnitude: 1.07399 au
magnitude: 2.72986 debye
