program: Orca
programVersion: 5.0.2
elementType: S S S P O O C C C C C C C C C H H H H H H H H H H H H H H H H H H H H H
charge: 0
multiplicity: 1
keywords: wb97x-d3
keywords: def2-TZVPP
keywords: def2/J RIJCOSX
keywords: DEFGRID2
keywords: scfconv7
keywords: smallprint printgap noloewdin
keywords: NOSOSCF
formula: C9H21O2PS3
InChI: InChI=1/C9H21O2PS3/c1-6-10-12(13,11-7-2)15-8-14-9(3,4)5/h6-8H2,1-5H3
36 atoms
S  3.033098 -0.158892 0.925264
S  0.069506 -0.047981 1.326464
S  -0.966578 0.878505 -1.797742
P  -1.461603 0.50783 0.034139
O  -2.507009 -0.688785 0.248816
O  -2.19539 1.689588 0.817116
C  3.194189 -1.266366 -0.543551
C  1.951548 -2.120043 -0.747752
C  3.491517 -0.443279 -1.788683
C  4.389129 -2.149712 -0.197652
C  1.539398 0.780278 0.605923
C  -2.321025 -1.977919 -0.364539
C  -3.265172 2.439284 0.194194
C  -3.667073 -2.638216 -0.511264
C  -2.792642 3.824018 -0.163821
H  1.079384 -1.522828 -1.01684
H  2.12785 -2.821478 -1.567481
H  1.705121 -2.699295 0.142309
H  2.658854 0.208274 -2.060351
H  3.666524 -1.108154 -2.639005
H  4.379097 0.17659 -1.658141
H  4.204265 -2.751865 0.69324
H  4.587056 -2.834138 -1.024894
H  5.296023 -1.565154 -0.03162
H  1.651866 1.755942 1.076308
H  1.379124 0.937871 -0.461565
H  -1.843381 -1.86161 -1.340349
H  -1.657599 -2.571675 0.267848
H  -3.643648 1.917659 -0.687359
H  -4.070956 2.472032 0.927194
H  -4.313757 -2.080439 -1.189139
H  -3.530022 -3.637648 -0.925726
H  -4.173047 -2.743645 0.448954
H  -3.623936 4.389912 -0.586494
H  -2.433371 4.364205 0.712457
H  -1.99581 3.792964 -0.907128
elementType: S P O C H
totalener: -2042.19968748 hartree
nucrepener: 1686.54490479 hartree
electener: -3728.74459227 hartree
oneelecener: -6168.24846490 hartree
twoeener: 2439.50387263 hartree
cpcmener: -0.01515976 hartree
kineticenergy: 2036.95470944 hartree
xcener: -124.853653458741 hartree
chargesum: 0.0000000
charge: -0.166911 -0.151173 -0.462119 0.666509 -0.345021 -0.355389 0.188213 -0.299175 -0.317254 -0.290402 -0.116397 0.044699 0.041456 -0.242579 -0.235514 0.053534 0.104450 0.098872 0.098588 0.099866 0.097603 0.104607 0.097789 0.104794 0.165313 0.115841 0.088920 0.098028 0.085266 0.105429 0.086924 0.087782 0.089304 0.092507 0.089633 0.076007
qa: -0.1669 -0.1512 -0.4621 0.6665 -0.3450 -0.3554 0.1882 -0.2992 -0.3173 -0.2904 -0.1164 0.0447 0.0415 -0.2426 -0.2355 0.0535 0.1044 0.0989 0.0986 0.0999 0.0976 0.1046 0.0978 0.1048 0.1653 0.1158 0.0889 0.0980 0.0853 0.1054 0.0869 0.0878 0.0893 0.0925 0.0896 0.0760
va: 2.2351 2.3104 1.9763 5.4127 2.1013 2.1097 3.8809 3.9134 3.9443 3.8648 3.9754 3.8414 3.8669 3.9678 3.9313 1.0275 1.0099 1.0146 1.0016 1.0033 1.0145 1.0119 1.0039 1.0100 0.9990 1.0521 1.0024 0.9929 1.0094 0.9961 1.0063 1.0064 1.0038 1.0081 1.0039 1.0185
dispcorr: -0.017362451 hartree
energy: -2042.217049931397
dipole: 3.85413 -4.40181 -0.54768 -8.28865 7.73396 -0.55469 -9.72660 9.22129 -0.50531
magnitude: 0.92897 au
magnitude: 2.36124 debye
