program: Orca
programVersion: 5.0.2
elementType: S S S P O O C C C C C C C C C H H H H H H H H H H H H H H H H H H H H H
charge: 0
multiplicity: 1
keywords: wb97x-d3
keywords: def2-TZVPP
keywords: def2/J RIJCOSX
keywords: DEFGRID2
keywords: scfconv7
keywords: smallprint printgap noloewdin
keywords: NOSOSCF
formula: C9H21O2PS3
InChI: InChI=1/C9H21O2PS3/c1-6-10-12(13,11-7-2)15-8-14-9(3,4)5/h6-8H2,1-5H3
36 atoms
S  3.053841 0.209182 -0.868793
S  0.38369 0.963538 0.240471
S  -2.146944 0.129909 -1.898784
P  -1.543236 0.246498 -0.070814
O  -1.499735 -1.131658 0.741756
O  -2.395465 1.18715 0.905485
C  3.671874 -1.033664 0.349101
C  3.491557 -2.444023 -0.194257
C  5.157585 -0.707672 0.472565
C  2.982984 -0.879179 1.696343
C  1.286349 -0.092471 -0.958664
C  -2.433789 -2.203783 0.509878
C  -3.118543 2.3482 0.455158
C  -3.818497 -1.89647 1.023068
C  -2.215071 3.522234 0.170218
H  3.99207 -2.571564 -1.154182
H  3.918372 -3.164914 0.507141
H  2.440762 -2.708526 -0.321207
H  5.322854 0.300672 0.85443
H  5.676121 -0.799624 -0.483404
H  5.625094 -1.406461 1.168949
H  3.099967 0.128036 2.096067
H  1.916643 -1.100227 1.642135
H  3.42407 -1.577858 2.411426
H  0.959022 0.168523 -1.963917
H  1.05248 -1.142245 -0.786239
H  -2.453746 -2.44117 -0.555807
H  -2.005954 -3.056196 1.036193
H  -3.711518 2.08747 -0.423619
H  -3.806365 2.577057 1.268052
H  -4.434711 -2.791104 0.926473
H  -3.802973 -1.614029 2.075734
H  -4.3017 -1.102517 0.453337
H  -2.830829 4.391857 -0.06228
H  -1.596921 3.773543 1.032269
H  -1.564505 3.341086 -0.685646
elementType: S P O C H
totalener: -2042.20027621 hartree
nucrepener: 1679.57167747 hartree
electener: -3721.77195368 hartree
oneelecener: -6154.37376443 hartree
twoeener: 2432.60181074 hartree
cpcmener: -0.01645076 hartree
kineticenergy: 2036.96506069 hartree
xcener: -124.856930754676 hartree
chargesum: 0.0000000
charge: -0.166365 -0.148296 -0.462925 0.644224 -0.345431 -0.359049 0.176523 -0.322429 -0.286422 -0.321115 -0.133329 0.033294 0.044357 -0.237337 -0.248902 0.098452 0.100223 0.104289 0.105162 0.104707 0.097747 0.100626 0.086271 0.103688 0.158201 0.137155 0.091846 0.106678 0.092449 0.108435 0.097350 0.090524 0.077727 0.101195 0.092413 0.078064
qa: -0.1664 -0.1483 -0.4629 0.6442 -0.3454 -0.3590 0.1765 -0.3224 -0.2864 -0.3211 -0.1333 0.0333 0.0444 -0.2373 -0.2489 0.0985 0.1002 0.1043 0.1052 0.1047 0.0977 0.1006 0.0863 0.1037 0.1582 0.1372 0.0918 0.1067 0.0924 0.1084 0.0973 0.0905 0.0777 0.1012 0.0924 0.0781
va: 2.2438 2.3027 1.9774 5.4172 2.0983 2.0911 3.8914 3.9426 3.8608 3.9135 4.0065 3.8600 3.8461 3.9020 3.9010 1.0132 1.0032 0.9993 1.0119 1.0104 1.0039 1.0124 1.0143 1.0071 1.0120 1.0129 1.0143 0.9907 1.0136 0.9907 1.0093 1.0064 1.0164 1.0115 1.0032 1.0184
dispcorr: -0.016963567 hartree
energy: -2042.217239777773
dipole: 7.88243 -8.12280 -0.24037 -8.48079 7.53902 -0.94177 8.99111 -7.90629 1.08481
magnitude: 1.45654 au
magnitude: 3.70224 debye
