program: Orca
programVersion: 5.0.2
elementType: S S S P O O C C C C C C C C C H H H H H H H H H H H H H H H H H H H H H
charge: 0
multiplicity: 1
keywords: wb97x-d3
keywords: def2-TZVPP
keywords: def2/J RIJCOSX
keywords: DEFGRID2
keywords: scfconv7
keywords: smallprint printgap noloewdin
keywords: NOSOSCF
formula: C9H21O2PS3
InChI: InChI=1/C9H21O2PS3/c1-6-10-12(13,11-7-2)15-8-14-9(3,4)5/h6-8H2,1-5H3
36 atoms
S  1.897542 -1.075099 0.733326
S  0.295307 1.365753 1.265097
S  -0.787519 0.550541 -1.871852
P  -1.179966 0.568369 0.014463
O  -1.55085 -0.821485 0.699104
O  -2.436711 1.449384 0.474318
C  3.204923 -1.588727 -0.460625
C  4.487202 -0.803759 -0.221619
C  3.426118 -3.067459 -0.156865
C  2.71974 -1.416997 -1.89316
C  1.786313 0.71001 0.467667
C  -1.933055 -1.994224 -0.042938
C  -2.595256 2.819572 0.058956
C  -3.373848 -1.934166 -0.483617
C  -4.056846 3.176046 0.137916
H  5.277839 -1.178128 -0.87705
H  4.367085 0.258667 -0.440049
H  4.832832 -0.901112 0.808248
H  2.513449 -3.650783 -0.293443
H  3.781073 -3.224964 0.862963
H  4.179284 -3.472242 -0.836344
H  3.484664 -1.773586 -2.58804
H  1.807698 -1.984987 -2.076256
H  2.520016 -0.374131 -2.141184
H  2.615301 1.243304 0.934351
H  1.762056 0.963446 -0.592366
H  -1.261866 -2.125572 -0.893577
H  -1.76674 -2.823133 0.643629
H  -2.001005 3.45809 0.716339
H  -2.222138 2.945001 -0.960283
H  -3.542677 -1.138859 -1.210572
H  -3.6428 -2.878502 -0.958861
H  -4.044978 -1.782301 0.36208
H  -4.654388 2.562806 -0.536955
H  -4.445333 3.06332 1.15043
H  -4.185751 4.218699 -0.15388
elementType: S P O C H
totalener: -2042.19989862 hartree
nucrepener: 1709.53657081 hartree
electener: -3751.73646942 hartree
oneelecener: -6214.78699645 hartree
twoeener: 2463.05052702 hartree
cpcmener: -0.01638069 hartree
kineticenergy: 2036.96214867 hartree
xcener: -124.857769583225 hartree
chargesum: -0.0000000
charge: -0.175164 -0.153848 -0.449809 0.650962 -0.338397 -0.352994 0.184618 -0.321720 -0.288394 -0.314737 -0.123417 0.049052 0.037348 -0.240937 -0.240516 0.100072 0.096834 0.099401 0.103801 0.103397 0.096883 0.103059 0.092561 0.091775 0.152250 0.130026 0.084313 0.109725 0.097055 0.089926 0.077800 0.095479 0.090604 0.086605 0.089023 0.087367
qa: -0.1752 -0.1538 -0.4498 0.6510 -0.3384 -0.3530 0.1846 -0.3217 -0.2884 -0.3147 -0.1234 0.0491 0.0373 -0.2409 -0.2405 0.1001 0.0968 0.0994 0.1038 0.1034 0.0969 0.1031 0.0926 0.0918 0.1523 0.1300 0.0843 0.1097 0.0971 0.0899 0.0778 0.0955 0.0906 0.0866 0.0890 0.0874
va: 2.2131 2.3108 1.9914 5.4160 2.0925 2.1044 3.8767 3.9222 3.8662 3.9474 4.0028 3.8398 3.8546 3.9333 3.9602 1.0043 1.0004 1.0125 1.0105 1.0117 1.0046 1.0071 1.0117 1.0060 0.9966 1.0250 1.0159 0.9910 0.9938 1.0064 1.0180 1.0084 1.0059 1.0067 1.0035 1.0064
dispcorr: -0.017195299 hartree
energy: -2042.217093916905
dipole: 6.37636 -5.89663 0.47973 -8.37286 8.44210 0.06925 -7.41122 7.09238 -0.31883
magnitude: 0.58017 au
magnitude: 1.47466 debye
