program: Orca
programVersion: 5.0.2
elementType: S S S P O O C C C C C C C C C H H H H H H H H H H H H H H H H H H H H H
charge: 0
multiplicity: 1
keywords: wb97x-d3
keywords: def2-TZVPP
keywords: def2/J RIJCOSX
keywords: DEFGRID2
keywords: scfconv7
keywords: smallprint printgap noloewdin
keywords: NOSOSCF
formula: C9H21O2PS3
InChI: InChI=1/C9H21O2PS3/c1-6-10-12(13,11-7-2)15-8-14-9(3,4)5/h6-8H2,1-5H3
36 atoms
S  1.778989 -0.838714 1.361976
S  0.806357 0.90507 -1.027724
S  -2.257271 0.860741 -2.244849
P  -1.227879 0.912697 -0.620244
O  -1.489705 -0.267673 0.432726
O  -1.397418 2.193358 0.320317
C  3.123839 -1.643866 0.38316
C  3.678534 -2.708753 1.325525
C  2.546571 -2.306797 -0.861755
C  4.216822 -0.653929 0.013709
C  1.558469 0.788155 0.644827
C  -1.521427 -1.63865 -0.004437
C  -2.660038 2.87132 0.491447
C  -1.752837 -2.514275 1.197839
C  -3.645734 2.084482 1.318494
H  2.902771 -3.399969 1.661491
H  4.435212 -3.298349 0.80366
H  4.144948 -2.267515 2.207035
H  2.090599 -1.583441 -1.536604
H  1.791121 -3.049279 -0.601954
H  3.340823 -2.818571 -1.411771
H  3.885182 0.081206 -0.720965
H  4.598461 -0.120716 0.885848
H  5.052714 -1.193622 -0.437413
H  0.958194 1.359232 1.352156
H  2.50798 1.31602 0.561036
H  -2.321125 -1.761453 -0.738277
H  -0.573492 -1.88868 -0.487032
H  -2.400904 3.807074 0.984928
H  -3.073333 3.113035 -0.489963
H  -0.946779 -2.417068 1.924539
H  -2.69917 -2.283315 1.68794
H  -1.791301 -3.555439 0.87572
H  -4.519077 2.709915 1.50916
H  -3.992515 1.187117 0.805661
H  -3.224578 1.797873 2.282229
elementType: S P O C H
totalener: -2042.20011821 hartree
nucrepener: 1716.49792652 hartree
electener: -3758.69804473 hartree
oneelecener: -6228.16892977 hartree
twoeener: 2469.47088505 hartree
cpcmener: -0.01663270 hartree
kineticenergy: 2036.96074429 hartree
xcener: -124.856869141501 hartree
chargesum: -0.0000000
charge: -0.160938 -0.153493 -0.452443 0.633555 -0.329870 -0.344540 0.195956 -0.290503 -0.342164 -0.324436 -0.155366 0.004885 0.025302 -0.240606 -0.232741 0.103098 0.097149 0.100758 0.099117 0.096427 0.109072 0.091420 0.105208 0.104366 0.159827 0.154086 0.115641 0.103296 0.107640 0.092311 0.082510 0.091893 0.089055 0.097585 0.077402 0.089543
qa: -0.1609 -0.1535 -0.4524 0.6336 -0.3299 -0.3445 0.1960 -0.2905 -0.3422 -0.3244 -0.1554 0.0049 0.0253 -0.2406 -0.2327 0.1031 0.0971 0.1008 0.0991 0.0964 0.1091 0.0914 0.1052 0.1044 0.1598 0.1541 0.1156 0.1033 0.1076 0.0923 0.0825 0.0919 0.0891 0.0976 0.0774 0.0895
va: 2.2530 2.3042 2.0132 5.4229 2.0559 2.0946 3.8362 3.8859 3.9306 3.9270 4.0259 3.8303 3.8722 3.9447 3.8893 1.0086 1.0045 1.0142 1.0194 1.0058 1.0076 0.9977 1.0088 1.0042 1.0151 0.9975 1.0156 0.9895 0.9902 1.0107 1.0158 1.0047 1.0056 1.0094 1.0195 1.0066
dispcorr: -0.018556935 hartree
energy: -2042.218675146976
dipole: 10.37846 -9.41712 0.96135 -14.56780 14.11631 -0.45149 11.24939 -9.90641 1.34298
magnitude: 1.71220 au
magnitude: 4.35206 debye
