program: Orca
programVersion: 5.0.2
elementType: S S S P O O C C C C C C C C C H H H H H H H H H H H H H H H H H H H H H
charge: 0
multiplicity: 1
keywords: wb97x-d3
keywords: def2-TZVPP
keywords: def2/J RIJCOSX
keywords: DEFGRID2
keywords: scfconv7
keywords: smallprint printgap noloewdin
keywords: NOSOSCF
formula: C9H21O2PS3
InChI: InChI=1/C9H21O2PS3/c1-6-10-12(13,11-7-2)15-8-14-9(3,4)5/h6-8H2,1-5H3
36 atoms
S  1.858977 -0.482084 1.207091
S  0.165819 0.209803 -1.288179
S  -3.085103 -0.14106 -1.549377
P  -1.67899 0.379448 -0.341667
O  -1.581678 -0.376994 1.059145
O  -1.736308 1.862356 0.261118
C  3.390058 -1.179055 0.4495
C  4.508957 -0.147405 0.480286
C  3.7424 -2.359746 1.350776
C  3.136963 -1.661422 -0.970991
C  1.316824 0.763222 0.032297
C  -2.075068 -1.716324 1.249754
C  -1.750565 3.005905 -0.61128
C  -1.239276 -2.768839 0.564064
C  -2.200069 4.201766 0.187764
H  4.717973 0.185403 1.497645
H  5.426515 -0.580374 0.072821
H  4.276561 0.733214 -0.12115
H  2.963194 -3.123682 1.341446
H  3.903656 -2.050115 2.38521
H  4.666935 -2.822808 0.9995
H  4.034587 -2.153925 -1.354164
H  2.316502 -2.377489 -1.016052
H  2.91138 -0.840607 -1.653512
H  0.849196 1.570963 0.594293
H  2.16703 1.20613 -0.48764
H  -2.063888 -1.85885 2.329628
H  -3.113722 -1.766029 0.916629
H  -0.747744 3.160402 -1.017558
H  -2.428212 2.82421 -1.449494
H  -1.632854 -3.751245 0.829054
H  -1.279099 -2.681777 -0.522112
H  -0.197571 -2.721442 0.87908
H  -3.208769 4.063888 0.578012
H  -1.527163 4.405483 1.021088
H  -2.20787 5.080346 -0.45778
elementType: S P O C H
totalener: -2042.20099228 hartree
nucrepener: 1706.35684859 hartree
electener: -3748.55784087 hartree
oneelecener: -6207.84137873 hartree
twoeener: 2459.28353786 hartree
cpcmener: -0.01865217 hartree
kineticenergy: 2036.95181818 hartree
xcener: -124.855944559127 hartree
chargesum: -0.0000000
charge: -0.171059 -0.153882 -0.450418 0.626807 -0.339849 -0.340173 0.199989 -0.320232 -0.298349 -0.326799 -0.150475 0.033534 0.029741 -0.243312 -0.243851 0.095987 0.098393 0.099394 0.107078 0.104866 0.099221 0.105766 0.104405 0.086710 0.158012 0.154679 0.111100 0.098242 0.099346 0.102495 0.103148 0.075981 0.079372 0.088139 0.088824 0.087167
qa: -0.1711 -0.1539 -0.4504 0.6268 -0.3398 -0.3402 0.2000 -0.3202 -0.2983 -0.3268 -0.1505 0.0335 0.0297 -0.2433 -0.2439 0.0960 0.0984 0.0994 0.1071 0.1049 0.0992 0.1058 0.1044 0.0867 0.1580 0.1547 0.1111 0.0982 0.0993 0.1025 0.1031 0.0760 0.0794 0.0881 0.0888 0.0872
va: 2.2420 2.2799 2.0128 5.4505 2.1031 2.0961 3.8364 3.9411 3.8825 3.9342 4.0055 3.8315 3.8266 3.8886 3.9666 1.0141 1.0032 1.0044 1.0061 1.0088 1.0039 1.0068 1.0073 0.9986 1.0164 1.0038 0.9925 1.0155 0.9958 1.0081 1.0135 1.0188 1.0236 1.0061 1.0026 1.0061
dispcorr: -0.017978282 hartree
energy: -2042.218970561905
dipole: 20.93030 -18.91605 2.01425 -3.35153 3.79711 0.44559 5.63337 -5.17972 0.45366
magnitude: 2.11224 au
magnitude: 5.36889 debye
