program: Orca
programVersion: 5.0.2
elementType: S S S P O O C C C C C C C C C H H H H H H H H H H H H H H H H H H H H H
charge: 0
multiplicity: 1
keywords: wb97x-d3
keywords: def2-TZVPP
keywords: def2/J RIJCOSX
keywords: DEFGRID2
keywords: scfconv7
keywords: smallprint printgap noloewdin
keywords: NOSOSCF
formula: C9H21O2PS3
InChI: InChI=1/C9H21O2PS3/c1-6-10-12(13,11-7-2)15-8-14-9(3,4)5/h6-8H2,1-5H3
36 atoms
S  2.748166 -1.386694 -1.009669
S  0.043348 -1.013904 0.255855
S  -2.114772 0.50357 -1.894997
P  -1.45586 0.388713 -0.086241
O  -2.52055 0.009426 1.048433
O  -0.78501 1.715603 0.506626
C  3.65134 -0.593607 0.399054
C  5.124183 -0.750747 0.031944
C  3.299724 0.878621 0.532505
C  3.356139 -1.343094 1.692551
C  1.1719 -0.542782 -1.111816
C  -3.698358 -0.780827 0.792365
C  -1.239857 3.035286 0.142926
C  -3.389809 -2.249644 0.651764
C  -2.591493 3.371507 0.72229
H  5.396066 -1.795746 -0.129364
H  5.376377 -0.192066 -0.869599
H  5.746896 -0.375553 0.8470
H  3.471323 1.427004 -0.394962
H  3.931948 1.326606 1.303006
H  2.26461 1.034225 0.840144
H  3.953819 -0.927644 2.508528
H  2.307544 -1.26373 1.978644
H  3.603273 -2.401586 1.605403
H  1.298743 0.53851 -1.137884
H  0.723043 -0.852809 -2.055503
H  -4.343308 -0.599262 1.651488
H  -4.205791 -0.397424 -0.094996
H  -0.473395 3.704326 0.532502
H  -1.244419 3.127063 -0.945321
H  -2.797123 -2.461818 -0.238364
H  -2.860436 -2.634475 1.523633
H  -4.327433 -2.800181 0.561598
H  -2.813609 4.418257 0.50916
H  -3.390042 2.772476 0.282839
H  -2.610061 3.241536 1.804473
elementType: S P O C H
totalener: -2042.19874710 hartree
nucrepener: 1690.08364763 hartree
electener: -3732.28239473 hartree
oneelecener: -6175.36632967 hartree
twoeener: 2443.08393493 hartree
cpcmener: -0.01548464 hartree
kineticenergy: 2036.96116060 hartree
xcener: -124.856373433234 hartree
chargesum: -0.0000000
charge: -0.166367 -0.156345 -0.460319 0.646576 -0.358653 -0.343929 0.164623 -0.290088 -0.314047 -0.310659 -0.129551 0.044408 0.034423 -0.247576 -0.237144 0.104215 0.100537 0.096603 0.106260 0.106422 0.084032 0.098307 0.095726 0.098310 0.134977 0.162495 0.108782 0.092238 0.106011 0.092319 0.077649 0.092612 0.100797 0.097465 0.077928 0.090960
qa: -0.1664 -0.1563 -0.4603 0.6466 -0.3587 -0.3439 0.1646 -0.2901 -0.3140 -0.3107 -0.1296 0.0444 0.0344 -0.2476 -0.2371 0.1042 0.1005 0.0966 0.1063 0.1064 0.0840 0.0983 0.0957 0.0983 0.1350 0.1625 0.1088 0.0922 0.1060 0.0923 0.0776 0.0926 0.1008 0.0975 0.0779 0.0910
va: 2.2467 2.3032 1.9782 5.4143 2.0920 2.1001 3.8545 3.8942 3.9205 3.9256 4.0252 3.8451 3.8582 3.9030 3.9038 1.0060 1.0150 1.0040 1.0061 1.0052 1.0165 1.0042 1.0216 1.0124 1.0070 1.0065 0.9909 1.0138 0.9905 1.0140 1.0188 1.0031 1.0114 1.0090 1.0166 1.0065
dispcorr: -0.017358175 hartree
energy: -2042.216105273184
dipole: 9.61422 -9.61331 0.00091 4.57514 -3.55732 1.01782 10.04308 -8.93921 1.10388
magnitude: 1.50150 au
magnitude: 3.81651 debye
