program: Orca
programVersion: 5.0.2
elementType: S S S P O O C C C C C C C C C H H H H H H H H H H H H H H H H H H H H H
charge: 0
multiplicity: 1
keywords: wb97x-d3
keywords: def2-TZVPP
keywords: def2/J RIJCOSX
keywords: DEFGRID2
keywords: scfconv7
keywords: smallprint printgap noloewdin
keywords: NOSOSCF
formula: C9H21O2PS3
InChI: InChI=1/C9H21O2PS3/c1-6-10-12(13,11-7-2)15-8-14-9(3,4)5/h6-8H2,1-5H3
36 atoms
S  2.742444 -1.57249 -0.262617
S  -0.157955 -1.495891 0.657191
S  -1.433932 0.67905 -1.657797
P  -1.463624 0.052967 0.17033
O  -2.872326 -0.497485 0.698086
O  -1.137799 1.126295 1.305588
C  3.261434 0.193371 -0.394987
C  4.660399 0.207639 0.213538
C  3.317092 0.610397 -1.857679
C  2.333862 1.111347 0.385843
C  1.017774 -1.570845 -0.754368
C  -3.681204 -1.378569 -0.106468
C  -1.779734 2.423507 1.300563
C  -4.973039 -0.693512 -0.470067
C  -0.792347 3.494372 0.915493
H  4.647468 -0.077141 1.266597
H  5.342216 -0.46381 -0.312228
H  5.077137 1.214658 0.146384
H  3.669705 1.642073 -1.938771
H  2.33498 0.569045 -2.332455
H  3.996312 -0.021994 -2.429926
H  2.214152 0.792185 1.420842
H  2.745968 2.123894 0.390265
H  1.349382 1.175499 -0.076196
H  0.787171 -0.771516 -1.460383
H  0.8239 -2.513473 -1.263853
H  -3.14266 -1.685587 -1.005945
H  -3.859325 -2.271934 0.492003
H  -2.641243 2.430196 0.628881
H  -2.153524 2.574474 2.313131
H  -4.79575 0.192259 -1.080707
H  -5.595908 -1.378674 -1.046493
H  -5.534285 -0.398928 0.417075
H  0.067101 3.507858 1.58673
H  -0.437611 3.363675 -0.1068
H  -1.279594 4.468668 0.978073
elementType: S P O C H
totalener: -2042.19804668 hartree
nucrepener: 1704.65467530 hartree
electener: -3746.85272197 hartree
oneelecener: -6204.58521227 hartree
twoeener: 2457.73249029 hartree
cpcmener: -0.01537814 hartree
kineticenergy: 2036.95298880 hartree
xcener: -124.852960264254 hartree
chargesum: 0.0000000
charge: -0.171387 -0.148731 -0.455863 0.660352 -0.358094 -0.343950 0.201741 -0.294139 -0.316454 -0.304101 -0.109898 0.041096 0.045276 -0.235251 -0.253191 0.105327 0.105190 0.097115 0.099044 0.097920 0.096677 0.104500 0.106246 0.039858 0.112159 0.163611 0.080975 0.105809 0.086590 0.105426 0.076243 0.092518 0.090230 0.092978 0.080012 0.104165
qa: -0.1714 -0.1487 -0.4559 0.6604 -0.3581 -0.3440 0.2017 -0.2941 -0.3165 -0.3041 -0.1099 0.0411 0.0453 -0.2353 -0.2532 0.1053 0.1052 0.0971 0.0990 0.0979 0.0967 0.1045 0.1062 0.0399 0.1122 0.1636 0.0810 0.1058 0.0866 0.1054 0.0762 0.0925 0.0902 0.0930 0.0800 0.1042
va: 2.2258 2.3117 1.9742 5.4044 2.0945 2.0856 3.8792 3.8719 3.9484 3.9195 3.9825 3.8591 3.8725 3.9476 3.9172 1.0111 1.0097 1.0040 1.0033 1.0021 1.0143 1.0158 1.0089 1.0233 1.0574 0.9970 1.0136 0.9959 1.0076 0.9965 1.0148 1.0085 1.0035 1.0009 1.0124 1.0106
dispcorr: -0.018570291 hartree
energy: -2042.216616966938
dipole: 6.46350 -7.04544 -0.58193 13.44491 -12.74374 0.70117 -2.25933 2.29723 0.03790
magnitude: 0.91199 au
magnitude: 2.31809 debye
