program: Orca
programVersion: 5.0.2
elementType: S S S P O O C C C C C C C C C H H H H H H H H H H H H H H H H H H H H H
charge: 0
multiplicity: 1
keywords: wb97x-d3
keywords: def2-TZVPP
keywords: def2/J RIJCOSX
keywords: DEFGRID2
keywords: scfconv7
keywords: smallprint printgap noloewdin
keywords: NOSOSCF
formula: C9H21O2PS3
InChI: InChI=1/C9H21O2PS3/c1-6-10-12(13,11-7-2)15-8-14-9(3,4)5/h6-8H2,1-5H3
36 atoms
S  1.559972 -1.547423 -0.306443
S  -0.240643 -0.426707 1.768503
S  -0.183818 2.08825 -0.550955
P  -1.269685 0.85478 0.453649
O  -2.269139 -0.058889 -0.399218
O  -2.29684 1.467121 1.511909
C  3.2700 -1.260005 -0.933061
C  4.293662 -1.685873 0.109806
C  3.364908 -2.156542 -2.16423
C  3.469686 0.195019 -1.332671
C  1.438271 -0.408504 1.091432
C  -1.836128 -0.872326 -1.506397
C  -2.923565 2.751578 1.310732
C  -1.999044 -2.332217 -1.166477
C  -3.930242 2.751111 0.18725
H  5.304468 -1.56762 -0.288862
H  4.232829 -1.080477 1.015398
H  4.166048 -2.730963 0.392833
H  2.650048 -1.862871 -2.934549
H  3.191018 -3.206017 -1.919889
H  4.365392 -2.080287 -2.595064
H  3.447365 0.86947 -0.475991
H  4.447574 0.313938 -1.806015
H  2.711201 0.524594 -2.042526
H  2.075157 -0.71844 1.920704
H  1.698345 0.612856 0.814992
H  -2.462629 -0.593724 -2.353937
H  -0.801841 -0.644049 -1.77139
H  -3.404781 2.971649 2.262178
H  -2.151409 3.505329 1.14389
H  -3.036513 -2.576149 -0.935746
H  -1.695498 -2.936773 -2.021923
H  -1.378659 -2.62034 -0.318184
H  -4.433767 3.718596 0.170325
H  -3.461808 2.611591 -0.787296
H  -4.690348 1.982186 0.325055
elementType: S P O C H
totalener: -2042.19670289 hartree
nucrepener: 1713.41355285 hartree
electener: -3755.61025575 hartree
oneelecener: -6222.43869360 hartree
twoeener: 2466.82843786 hartree
cpcmener: -0.01541976 hartree
kineticenergy: 2036.96604910 hartree
xcener: -124.859808183694 hartree
chargesum: -0.0000000
charge: -0.190136 -0.149610 -0.443803 0.646331 -0.331399 -0.355585 0.199836 -0.318292 -0.289156 -0.322567 -0.120828 0.041135 0.026780 -0.235755 -0.236654 0.099181 0.097624 0.097061 0.104921 0.104190 0.097199 0.097412 0.102942 0.095748 0.153602 0.125338 0.111026 0.069590 0.107394 0.094071 0.097273 0.094810 0.064178 0.096897 0.078780 0.090467
qa: -0.1901 -0.1496 -0.4438 0.6463 -0.3314 -0.3556 0.1998 -0.3183 -0.2892 -0.3226 -0.1208 0.0411 0.0268 -0.2358 -0.2367 0.0992 0.0976 0.0971 0.1049 0.1042 0.0972 0.0974 0.1029 0.0957 0.1536 0.1253 0.1110 0.0696 0.1074 0.0941 0.0973 0.0948 0.0642 0.0969 0.0788 0.0905
va: 2.2356 2.3055 1.9990 5.3988 2.0786 2.1143 3.8715 3.9273 3.8650 3.9395 4.0073 3.8284 3.8753 3.9276 3.8875 1.0038 1.0026 1.0134 1.0098 1.0099 1.0046 1.0024 1.0065 1.0158 0.9965 1.0289 0.9948 1.0344 0.9905 1.0088 1.0060 1.0087 1.0239 1.0088 1.0195 1.0071
dispcorr: -0.017977191 hartree
energy: -2042.214680083722
dipole: 11.35405 -10.81964 0.53441 -6.61972 6.44592 -0.17381 -11.59798 11.28012 -0.31787
magnitude: 0.64564 au
magnitude: 1.64108 debye
