program: Orca
programVersion: 5.0.2
elementType: S S S P O O C C C C C C C C C H H H H H H H H H H H H H H H H H H H H H
charge: 0
multiplicity: 1
keywords: wb97x-d3
keywords: def2-TZVPP
keywords: def2/J RIJCOSX
keywords: DEFGRID2
keywords: scfconv7
keywords: smallprint printgap noloewdin
keywords: NOSOSCF
formula: C9H21O2PS3
InChI: InChI=1/C9H21O2PS3/c1-6-10-12(13,11-7-2)15-8-14-9(3,4)5/h6-8H2,1-5H3
36 atoms
S  2.030596 0.252484 -0.947369
S  -0.07105 -1.6259 0.340652
S  -1.648366 0.531257 -1.765864
P  -1.330763 0.014549 0.065803
O  -2.585426 -0.409421 0.964978
O  -0.726694 1.146339 1.018097
C  3.423364 -0.00131 0.233926
C  2.929224 -0.461866 1.597309
C  4.429775 -0.990128 -0.338036
C  4.053688 1.38432 0.349146
C  1.156861 -1.314918 -0.981122
C  -3.349119 -1.622429 0.831681
C  -0.593531 2.525455 0.634438
C  -4.141093 -1.717327 -0.449667
C  -1.878129 3.287509 0.845538
H  3.765151 -0.466906 2.301848
H  2.157508 0.197956 1.994262
H  2.525699 -1.474013 1.570599
H  4.824521 -0.652031 -1.29657
H  3.997548 -1.982014 -0.480935
H  5.271028 -1.104099 0.350541
H  4.391646 1.763179 -0.617244
H  3.359623 2.110462 0.775964
H  4.925553 1.334442 1.004771
H  0.641424 -1.366898 -1.93938
H  1.842468 -2.161863 -0.936198
H  -2.689116 -2.48607 0.942159
H  -4.0175 -1.613339 1.691637
H  0.20383 2.917147 1.26533
H  -0.259809 2.592805 -0.40193
H  -4.794522 -2.588502 -0.383957
H  -4.769106 -0.839495 -0.601749
H  -3.504609 -1.844163 -1.323775
H  -2.674517 2.921708 0.196312
H  -2.216669 3.226007 1.880238
H  -1.715438 4.340081 0.609163
elementType: S P O C H
totalener: -2042.19516134 hartree
nucrepener: 1734.35544343 hartree
electener: -3776.55060478 hartree
oneelecener: -6264.50829671 hartree
twoeener: 2487.95769193 hartree
cpcmener: -0.01690231 hartree
kineticenergy: 2036.96537924 hartree
xcener: -124.861780624362 hartree
chargesum: 0.0000000
charge: -0.169065 -0.171659 -0.456348 0.660428 -0.356205 -0.345398 0.193497 -0.326025 -0.320744 -0.293496 -0.135280 0.017901 0.055338 -0.236972 -0.245455 0.104784 0.097978 0.091673 0.096797 0.100324 0.099153 0.104619 0.104896 0.098034 0.159579 0.151910 0.095985 0.107514 0.105210 0.083038 0.099132 0.088054 0.078903 0.078715 0.089033 0.094155
qa: -0.1691 -0.1717 -0.4563 0.6604 -0.3562 -0.3454 0.1935 -0.3260 -0.3207 -0.2935 -0.1353 0.0179 0.0553 -0.2370 -0.2455 0.1048 0.0980 0.0917 0.0968 0.1003 0.0992 0.1046 0.1049 0.0980 0.1596 0.1519 0.0960 0.1075 0.1052 0.0830 0.0991 0.0881 0.0789 0.0787 0.0890 0.0942
va: 2.2444 2.2897 1.9713 5.4048 2.1123 2.0831 3.8587 3.9280 3.9359 3.8745 3.9842 3.8932 3.8299 3.8852 3.9450 1.0070 1.0155 1.0030 1.0136 1.0038 1.0031 1.0093 1.0090 1.0044 1.0195 1.0041 0.9964 0.9890 0.9895 1.0189 1.0104 1.0082 1.0202 1.0189 1.0059 1.0079
dispcorr: -0.017897766 hartree
energy: -2042.213059109254
dipole: 11.72790 -10.91321 0.81469 2.59589 -3.28803 -0.69214 6.42315 -5.42767 0.99549
magnitude: 1.46074 au
magnitude: 3.71291 debye
