program: Orca
programVersion: 5.0.2
elementType: S S S P O O C C C C C C C C C H H H H H H H H H H H H H H H H H H H H H
charge: 0
multiplicity: 1
keywords: wb97x-d3
keywords: def2-TZVPP
keywords: def2/J RIJCOSX
keywords: DEFGRID2
keywords: scfconv7
keywords: smallprint printgap noloewdin
keywords: NOSOSCF
formula: C9H21O2PS3
InChI: InChI=1/C9H21O2PS3/c1-6-10-12(13,11-7-2)15-8-14-9(3,4)5/h6-8H2,1-5H3
36 atoms
S  3.168342 0.00213 0.323106
S  0.413606 0.953311 1.203305
S  -1.203867 0.597949 -1.795515
P  -1.328092 0.550487 0.13154
O  -1.782348 -0.8292 0.792197
O  -2.399732 1.546991 0.784436
C  2.834872 -1.626869 -0.475967
C  4.025831 -2.482072 -0.05332
C  1.537469 -2.244414 0.02368
C  2.807183 -1.477673 -1.990145
C  1.736939 1.007841 -0.067921
C  -2.968833 -1.517398 0.333191
C  -2.452799 2.933548 0.396056
C  -2.585793 -2.761645 -0.424133
C  -3.64888 3.187541 -0.483893
H  3.936438 -3.474543 -0.499434
H  4.973425 -2.055747 -0.387712
H  4.07245 -2.608968 1.029298
H  1.444764 -3.261378 -0.366063
H  0.665848 -1.693655 -0.326042
H  1.498969 -2.296065 1.111153
H  2.693852 -2.459598 -2.456569
H  1.967805 -0.867701 -2.32795
H  3.72667 -1.030697 -2.368396
H  2.076978 2.040597 -0.115677
H  1.310663 0.763714 -1.041262
H  -3.539598 -1.75829 1.229411
H  -3.588108 -0.862383 -0.282925
H  -2.515704 3.50308 1.322823
H  -1.528912 3.230849 -0.106836
H  -2.053727 -2.520128 -1.343809
H  -1.960026 -3.41957 0.17919
H  -3.488699 -3.31151 -0.692752
H  -3.704377 4.250772 -0.719485
H  -3.576322 2.638995 -1.422669
H  -4.577261 2.907166 0.014481
elementType: S P O C H
totalener: -2042.19763741 hartree
nucrepener: 1707.10814901 hartree
electener: -3749.30578641 hartree
oneelecener: -6209.51726867 hartree
twoeener: 2460.21148226 hartree
cpcmener: -0.01507793 hartree
kineticenergy: 2036.97331233 hartree
xcener: -124.857580413950 hartree
chargesum: -0.0000000
charge: -0.167315 -0.149517 -0.452753 0.661320 -0.346008 -0.357587 0.192954 -0.292974 -0.290207 -0.317943 -0.118574 0.041853 0.045244 -0.245285 -0.240495 0.097410 0.105111 0.105441 0.104590 0.036471 0.102309 0.099911 0.095567 0.097825 0.163981 0.118305 0.104779 0.087297 0.107432 0.079998 0.079114 0.089826 0.101864 0.093921 0.076534 0.089600
qa: -0.1673 -0.1495 -0.4528 0.6613 -0.3460 -0.3576 0.1930 -0.2930 -0.2902 -0.3179 -0.1186 0.0419 0.0452 -0.2453 -0.2405 0.0974 0.1051 0.1054 0.1046 0.0365 0.1023 0.0999 0.0956 0.0978 0.1640 0.1183 0.1048 0.0873 0.1074 0.0800 0.0791 0.0898 0.1019 0.0939 0.0765 0.0896
va: 2.2305 2.3084 1.9799 5.4030 2.0876 2.0913 3.8855 3.8663 3.9152 3.9404 3.9827 3.8809 3.8665 3.9126 3.9409 1.0041 1.0107 1.0108 1.0091 1.0230 1.0169 1.0034 1.0062 1.0150 0.9962 1.0578 0.9963 1.0059 0.9949 1.0107 1.0145 1.0022 1.0108 1.0086 1.0184 1.0035
dispcorr: -0.018562118 hartree
energy: -2042.216199523434
dipole: 0.23028 -1.06358 -0.83331 -12.44994 12.27281 -0.17714 -7.64110 7.44632 -0.19478
magnitude: 0.87391 au
magnitude: 2.22130 debye
