program: Orca
programVersion: 5.0.2
elementType: S S S P O O C C C C C C C C C H H H H H H H H H H H H H H H H H H H H H
charge: 0
multiplicity: 1
keywords: wb97x-d3
keywords: def2-TZVPP
keywords: def2/J RIJCOSX
keywords: DEFGRID2
keywords: scfconv7
keywords: smallprint printgap noloewdin
keywords: NOSOSCF
formula: C9H21O2PS3
InChI: InChI=1/C9H21O2PS3/c1-6-10-12(13,11-7-2)15-8-14-9(3,4)5/h6-8H2,1-5H3
36 atoms
S  1.84022 0.227113 1.222199
S  -0.07018 -1.012754 -0.875681
S  -2.748867 0.413232 -2.090768
P  -1.70302 0.215644 -0.488479
O  -2.434988 -0.336627 0.820571
O  -1.126274 1.543717 0.189454
C  3.472816 -0.248458 0.510196
C  3.391275 -0.425871 -0.998973
C  4.371679 0.936832 0.851359
C  4.000138 -1.51274 1.1741
C  0.741519 -1.115849 0.765577
C  -3.471347 -1.335579 0.767546
C  -0.36148 2.472907 -0.60109
C  -2.948451 -2.723095 0.484913
C  0.050279 3.620673 0.281614
H  2.773714 -1.278787 -1.283653
H  2.992477 0.46148 -1.491056
H  4.391892 -0.609963 -1.39873
H  4.442898 1.098279 1.928566
H  4.017074 1.860669 0.390989
H  5.380873 0.748099 0.479636
H  5.000151 -1.739808 0.795946
H  4.067965 -1.400615 2.256523
H  3.376659 -2.382906 0.962292
H  1.266474 -2.071439 0.767998
H  -0.026543 -1.190617 1.534699
H  -3.939214 -1.294074 1.750038
H  -4.219515 -1.041438 0.028474
H  0.515877 1.967094 -1.010495
H  -0.973742 2.823064 -1.43551
H  -2.565848 -2.824849 -0.530115
H  -2.162458 -3.009999 1.184392
H  -3.768934 -3.433043 0.599336
H  -0.813966 4.144076 0.691474
H  0.681983 3.286026 1.104282
H  0.621883 4.335378 -0.311212
elementType: S P O C H
totalener: -2042.20165852 hartree
nucrepener: 1715.97993784 hartree
electener: -3758.18159636 hartree
oneelecener: -6227.03953479 hartree
twoeener: 2468.85793843 hartree
cpcmener: -0.01831971 hartree
kineticenergy: 2036.96570563 hartree
xcener: -124.859064816001 hartree
chargesum: 0.0000000
charge: -0.162890 -0.152841 -0.450209 0.623793 -0.342195 -0.333174 0.193561 -0.332992 -0.293752 -0.323004 -0.147995 0.037699 0.003308 -0.256982 -0.240200 0.090899 0.105495 0.107246 0.105184 0.104862 0.098355 0.099303 0.097538 0.101405 0.157103 0.153030 0.109359 0.094565 0.094138 0.117559 0.083205 0.091836 0.105072 0.092007 0.081078 0.088635
qa: -0.1629 -0.1528 -0.4502 0.6238 -0.3422 -0.3332 0.1936 -0.3330 -0.2938 -0.3230 -0.1480 0.0377 0.0033 -0.2570 -0.2402 0.0909 0.1055 0.1072 0.1052 0.1049 0.0984 0.0993 0.0975 0.1014 0.1571 0.1530 0.1094 0.0946 0.0941 0.1176 0.0832 0.0918 0.1051 0.0920 0.0811 0.0886
va: 2.2531 2.2852 2.0216 5.4601 2.0987 2.0949 3.8491 3.9394 3.8695 3.9305 4.0039 3.8438 3.8296 3.9005 3.9473 0.9996 1.0064 1.0061 1.0098 1.0106 1.0044 1.0032 1.0143 1.0033 1.0026 1.0199 0.9916 1.0137 1.0038 1.0113 1.0142 1.0031 1.0117 1.0055 1.0136 1.0052
dispcorr: -0.018344910 hartree
energy: -2042.220003431655
dipole: 21.82844 -20.20595 1.62249 -2.17455 1.23933 -0.93521 7.66485 -6.62288 1.04197
magnitude: 2.14308 au
magnitude: 5.44728 debye
