program: Orca
programVersion: 5.0.2
elementType: S S S P O O C C C C C C C C C H H H H H H H H H H H H H H H H H H H H H
charge: 0
multiplicity: 1
keywords: wb97x-d3
keywords: def2-TZVPP
keywords: def2/J RIJCOSX
keywords: DEFGRID2
keywords: scfconv7
keywords: smallprint printgap noloewdin
keywords: NOSOSCF
formula: C9H21O2PS3
InChI: InChI=1/C9H21O2PS3/c1-6-10-12(13,11-7-2)15-8-14-9(3,4)5/h6-8H2,1-5H3
36 atoms
S  1.662801 -1.120387 1.097962
S  0.400211 0.939298 -0.831486
S  -2.676327 0.874012 -1.923863
P  -1.595752 0.605563 -0.355394
O  -1.658057 -0.821488 0.363366
O  -1.944624 1.472191 0.942678
C  3.322625 -1.332557 0.320886
C  3.596386 -2.82864 0.445065
C  3.311693 -0.921177 -1.143999
C  4.369112 -0.541889 1.093964
C  1.243836 0.591902 0.76086
C  -1.479294 -2.026057 -0.404811
C  -2.500715 2.797861 0.855582
C  -1.562189 -3.199927 0.534227
C  -1.512434 3.831622 0.373958
H  4.585445 -3.052674 0.040141
H  3.584989 -3.160867 1.484933
H  2.867953 -3.421832 -0.109927
H  3.161805 0.151876 -1.272394
H  2.539173 -1.443713 -1.708179
H  4.277808 -1.160918 -1.59561
H  4.414571 -0.85095 2.138588
H  5.35671 -0.700297 0.653124
H  4.176316 0.532089 1.06793
H  0.620678 0.953314 1.578154
H  2.136016 1.218794 0.760856
H  -2.258351 -2.081974 -1.168624
H  -0.509021 -2.000317 -0.906057
H  -3.38468 2.775951 0.21502
H  -2.828957 3.021795 1.869505
H  -0.775138 -3.166608 1.287404
H  -2.528498 -3.245923 1.037441
H  -1.440281 -4.120747 -0.036896
H  -1.232243 3.682694 -0.668559
H  -1.974971 4.816609 0.451123
H  -0.606959 3.841708 0.98107
elementType: S P O C H
totalener: -2042.20177177 hartree
nucrepener: 1712.49517117 hartree
electener: -3754.69694293 hartree
oneelecener: -6220.12091372 hartree
twoeener: 2465.42397079 hartree
cpcmener: -0.01787352 hartree
kineticenergy: 2036.96254435 hartree
xcener: -124.858623472428 hartree
chargesum: -0.0000000
charge: -0.165506 -0.149902 -0.450496 0.626675 -0.337473 -0.343753 0.196740 -0.293835 -0.329971 -0.320844 -0.146957 0.001573 0.039063 -0.240075 -0.250877 0.098287 0.104830 0.104820 0.087569 0.104935 0.107107 0.096313 0.099005 0.100703 0.154479 0.154380 0.116806 0.096597 0.094847 0.109648 0.081363 0.092101 0.088578 0.079210 0.102840 0.091219
qa: -0.1655 -0.1499 -0.4505 0.6267 -0.3375 -0.3438 0.1967 -0.2938 -0.3300 -0.3208 -0.1470 0.0016 0.0391 -0.2401 -0.2509 0.0983 0.1048 0.1048 0.0876 0.1049 0.1071 0.0963 0.0990 0.1007 0.1545 0.1544 0.1168 0.0966 0.0948 0.1096 0.0814 0.0921 0.0886 0.0792 0.1028 0.0912
va: 2.2496 2.2906 2.0174 5.4533 2.0956 2.0946 3.8382 3.8753 3.9377 3.9386 4.0063 3.8270 3.8401 3.9471 3.8996 1.0042 1.0087 1.0103 0.9982 1.0083 1.0065 1.0139 1.0030 1.0039 1.0205 1.0044 1.0112 1.0066 1.0136 0.9919 1.0134 1.0050 1.0055 1.0164 1.0113 1.0047
dispcorr: -0.018091212 hartree
energy: -2042.219862977847
dipole: 20.37822 -18.54978 1.82843 -7.52638 7.62358 0.09720 6.30449 -5.34256 0.96193
magnitude: 2.06832 au
magnitude: 5.25725 debye
