program: Orca
programVersion: 5.0.2
elementType: S S S P O O C C C C C C C C C H H H H H H H H H H H H H H H H H H H H H
charge: 0
multiplicity: 1
keywords: wb97x-d3
keywords: def2-TZVPP
keywords: def2/J RIJCOSX
keywords: DEFGRID2
keywords: scfconv7
keywords: smallprint printgap noloewdin
keywords: NOSOSCF
formula: C9H21O2PS3
InChI: InChI=1/C9H21O2PS3/c1-6-10-12(13,11-7-2)15-8-14-9(3,4)5/h6-8H2,1-5H3
36 atoms
S  2.017485 -0.379919 1.187792
S  0.377227 0.06774 -1.406566
S  -2.899687 -0.118145 -1.738202
P  -1.477398 0.493434 -0.591467
O  -1.502689 -0.048509 0.915335
O  -1.364777 2.069294 -0.340784
C  3.458377 -1.313187 0.511036
C  4.649481 -0.386079 0.314796
C  3.766742 -2.342836 1.594648
C  3.105144 -2.015706 -0.791542
C  1.548066 0.721999 -0.146902
C  -2.065756 -1.319056 1.288806
C  -2.455317 2.794316 0.269667
C  -1.249479 -2.4976 0.818087
C  -2.516481 4.168912 -0.342899
H  4.936321 0.101876 1.246766
H  5.509391 -0.957032 -0.044847
H  4.451187 0.390619 -0.425774
H  2.932901 -3.029409 1.750154
H  4.002891 -1.872048 2.550891
H  4.63448 -2.936155 1.298997
H  2.915298 -1.31201 -1.603261
H  3.944263 -2.641661 -1.105938
H  2.230031 -2.656705 -0.684712
H  1.127545 1.625576 0.291639
H  2.423052 1.040591 -0.713979
H  -2.108194 -1.28954 2.37696
H  -3.090223 -1.380085 0.91579
H  -3.398375 2.264938 0.112444
H  -2.272603 2.845872 1.343937
H  -0.213495 -2.424313 1.147618
H  -1.678649 -3.408567 1.237887
H  -1.262632 -2.598218 -0.267493
H  -2.730985 4.11921 -1.41049
H  -3.314253 4.739532 0.13341
H  -1.584389 4.716095 -0.198489
elementType: S P O C H
totalener: -2042.20023159 hartree
nucrepener: 1700.36322051 hartree
electener: -3742.56345210 hartree
oneelecener: -6196.00508316 hartree
twoeener: 2453.44163107 hartree
cpcmener: -0.01797355 hartree
kineticenergy: 2036.94967411 hartree
xcener: -124.854417389272 hartree
chargesum: -0.0000000
charge: -0.166990 -0.141104 -0.456280 0.632340 -0.339295 -0.348591 0.195243 -0.319982 -0.294755 -0.330498 -0.157183 0.036786 0.040308 -0.241465 -0.236939 0.096486 0.098986 0.101361 0.107322 0.104843 0.098959 0.088496 0.105961 0.104583 0.156929 0.152884 0.109205 0.095832 0.089184 0.101940 0.078795 0.101941 0.073982 0.085517 0.087376 0.087823
qa: -0.1670 -0.1411 -0.4563 0.6323 -0.3393 -0.3486 0.1952 -0.3200 -0.2948 -0.3305 -0.1572 0.0368 0.0403 -0.2415 -0.2369 0.0965 0.0990 0.1014 0.1073 0.1048 0.0990 0.0885 0.1060 0.1046 0.1569 0.1529 0.1092 0.0958 0.0892 0.1019 0.0788 0.1019 0.0740 0.0855 0.0874 0.0878
va: 2.2372 2.2977 2.0034 5.4265 2.0689 2.0887 3.8462 3.9371 3.8760 3.9404 4.0219 3.8382 3.8448 3.8943 3.9595 1.0140 1.0031 1.0036 1.0062 1.0094 1.0041 0.9984 1.0067 1.0062 1.0194 1.0066 0.9915 1.0149 1.0097 0.9975 1.0249 1.0153 1.0191 1.0072 1.0075 1.0035
dispcorr: -0.017916415 hartree
energy: -2042.218148005974
dipole: 17.09817 -15.72749 1.37068 -4.95540 5.17057 0.21517 9.45953 -8.06065 1.39889
magnitude: 1.97026 au
magnitude: 5.00801 debye
