program: Orca
programVersion: 5.0.2
elementType: S S S P O O C C C C C C C C C H H H H H H H H H H H H H H H H H H H H H
charge: 0
multiplicity: 1
keywords: wb97x-d3
keywords: def2-TZVPP
keywords: def2/J RIJCOSX
keywords: DEFGRID2
keywords: scfconv7
keywords: smallprint printgap noloewdin
keywords: NOSOSCF
formula: C9H21O2PS3
InChI: InChI=1/C9H21O2PS3/c1-6-10-12(13,11-7-2)15-8-14-9(3,4)5/h6-8H2,1-5H3
36 atoms
S  1.702431 -1.481385 -0.611504
S  0.422752 1.207679 0.205901
S  -1.81223 0.58744 -2.287937
P  -1.483968 0.589556 -0.392811
O  -1.747989 -0.848341 0.242126
O  -2.382204 1.548272 0.524034
C  3.155334 -1.524537 0.525227
C  4.415427 -1.099367 -0.216487
C  2.929656 -0.650659 1.749378
C  3.257573 -2.989085 0.939589
C  1.467133 0.263173 -0.959409
C  -1.612195 -1.136133 1.648015
C  -2.94978 2.788358 0.058465
C  -1.334171 -2.60736 1.807975
C  -1.933537 3.897859 -0.046787
H  4.356427 -0.070269 -0.57517
H  5.277674 -1.154941 0.453595
H  4.613023 -1.744808 -1.073121
H  2.011262 -0.914338 2.273709
H  2.885037 0.409519 1.498761
H  3.76301 -0.778811 2.444829
H  4.121209 -3.122454 1.594494
H  2.372246 -3.31795 1.486263
H  3.392266 -3.648604 0.080341
H  2.420103 0.792186 -0.989203
H  1.029672 0.350073 -1.954636
H  -0.797763 -0.546994 2.076735
H  -2.537693 -0.851766 2.151468
H  -3.446327 2.619972 -0.89909
H  -3.714901 3.033288 0.794021
H  -2.132462 -3.218601 1.386439
H  -0.392717 -2.882835 1.33284
H  -1.260295 -2.843054 2.87021
H  -2.453189 4.825071 -0.293481
H  -1.405828 4.053067 0.894588
H  -1.200137 3.71243 -0.831754
elementType: S P O C H
totalener: -2042.19978567 hartree
nucrepener: 1717.02208376 hartree
electener: -3759.22186942 hartree
oneelecener: -6229.39772306 hartree
twoeener: 2470.17585364 hartree
cpcmener: -0.01887189 hartree
kineticenergy: 2036.96158094 hartree
xcener: -124.857743439048 hartree
chargesum: 0.0000000
charge: -0.169367 -0.165565 -0.444531 0.631320 -0.328779 -0.345111 0.191701 -0.318968 -0.331198 -0.295049 -0.138341 0.003119 0.034274 -0.227234 -0.244239 0.100817 0.098706 0.097036 0.102284 0.089657 0.106881 0.099795 0.107747 0.105127 0.152312 0.157125 0.099396 0.113669 0.092876 0.105351 0.093810 0.067270 0.089347 0.101559 0.090269 0.076932
qa: -0.1694 -0.1656 -0.4445 0.6313 -0.3288 -0.3451 0.1917 -0.3190 -0.3312 -0.2950 -0.1383 0.0031 0.0343 -0.2272 -0.2442 0.1008 0.0987 0.0970 0.1023 0.0897 0.1069 0.0998 0.1077 0.1051 0.1523 0.1571 0.0994 0.1137 0.0929 0.1054 0.0938 0.0673 0.0893 0.1016 0.0903 0.0769
va: 2.2377 2.2838 2.0175 5.4378 2.1146 2.0891 3.8588 3.9347 3.9422 3.8764 3.9862 3.8562 3.8668 3.9295 3.8824 1.0043 1.0031 1.0141 1.0044 1.0000 1.0072 1.0042 1.0041 1.0097 1.0045 1.0273 0.9995 0.9996 1.0116 0.9901 1.0065 1.0261 1.0073 1.0119 1.0036 1.0192
dispcorr: -0.018248541 hartree
energy: -2042.218034206962
dipole: 16.86108 -15.64639 1.21469 -5.33179 5.98246 0.65068 14.59603 -12.51697 2.07906
magnitude: 2.49426 au
magnitude: 6.33992 debye
