program: Orca
programVersion: 5.0.2
elementType: S S S P O O C C C C C C C C C H H H H H H H H H H H H H H H H H H H H H
charge: 0
multiplicity: 1
keywords: wb97x-d3
keywords: def2-TZVPP
keywords: def2/J RIJCOSX
keywords: DEFGRID2
keywords: scfconv7
keywords: smallprint printgap noloewdin
keywords: NOSOSCF
formula: C9H21O2PS3
InChI: InChI=1/C9H21O2PS3/c1-6-10-12(13,11-7-2)15-8-14-9(3,4)5/h6-8H2,1-5H3
36 atoms
S  1.848303 -1.065222 -0.910546
S  0.709731 1.36555 0.644358
S  -1.266836 1.577245 -2.139489
P  -1.13521 1.063014 -0.290108
O  -1.539707 -0.475294 -0.111369
O  -1.989334 1.894726 0.779082
C  3.148549 -1.67418 0.248563
C  3.066647 -3.192521 0.120482
C  4.520304 -1.185815 -0.194996
C  2.861951 -1.250128 1.680746
C  1.820863 0.711837 -0.652138
C  -1.588844 -1.123858 1.173395
C  -3.288235 2.444305 0.482641
C  -1.447358 -2.609136 0.963984
C  -4.355885 1.387312 0.338027
H  2.096801 -3.575547 0.442574
H  3.239838 -3.524703 -0.904969
H  3.831542 -3.65434 0.748341
H  4.600957 -0.097883 -0.166258
H  4.7540 -1.515093 -1.207744
H  5.290247 -1.580177 0.473163
H  3.588054 -1.716465 2.351714
H  2.94947 -0.17155 1.817083
H  1.865252 -1.553226 2.00279
H  2.810241 1.090035 -0.393406
H  1.544632 1.179726 -1.597668
H  -0.786795 -0.753402 1.817131
H  -2.541538 -0.885506 1.650582
H  -3.506462 3.101778 1.322873
H  -3.221049 3.060215 -0.416593
H  -0.489743 -2.854924 0.504555
H  -1.498736 -3.111976 1.930371
H  -2.247242 -3.007528 0.338999
H  -4.209904 0.772492 -0.550535
H  -4.399717 0.737408 1.212362
H  -5.325539 1.877326 0.240923
elementType: S P O C H
totalener: -2042.19963184 hartree
nucrepener: 1719.10013008 hartree
electener: -3761.29976192 hartree
oneelecener: -6233.57564702 hartree
twoeener: 2472.27588510 hartree
cpcmener: -0.02004433 hartree
kineticenergy: 2036.95222487 hartree
xcener: -124.854526301864 hartree
chargesum: 0.0000000
charge: -0.169804 -0.155305 -0.443616 0.620640 -0.318243 -0.348942 0.190764 -0.298553 -0.318154 -0.329548 -0.156718 0.007094 0.033295 -0.230818 -0.253720 0.109516 0.105926 0.099801 0.100853 0.097195 0.098410 0.107171 0.090158 0.100548 0.152144 0.161747 0.098648 0.115805 0.106816 0.095379 0.066896 0.090349 0.095372 0.086343 0.089006 0.103548
qa: -0.1698 -0.1553 -0.4436 0.6206 -0.3182 -0.3489 0.1908 -0.2986 -0.3182 -0.3295 -0.1567 0.0071 0.0333 -0.2308 -0.2537 0.1095 0.1059 0.0998 0.1009 0.0972 0.0984 0.1072 0.0902 0.1005 0.1521 0.1617 0.0986 0.1158 0.1068 0.0954 0.0669 0.0903 0.0954 0.0863 0.0890 0.1035
va: 2.2355 2.2917 2.0252 5.4218 2.0670 2.0784 3.8555 3.8810 3.9327 3.9414 3.9954 3.8491 3.8640 3.9388 3.8933 1.0019 1.0094 1.0042 1.0046 1.0139 1.0032 1.0072 1.0003 1.0034 1.0045 1.0222 1.0006 0.9939 0.9904 1.0095 1.0229 1.0069 1.0061 1.0163 1.0035 1.0104
dispcorr: -0.018708940 hartree
energy: -2042.218340780936
dipole: 7.77201 -7.41149 0.36052 -17.56635 16.85377 -0.71259 12.13050 -9.94965 2.18084
magnitude: 2.32246 au
magnitude: 5.90323 debye
