program: Orca
programVersion: 5.0.2
elementType: S S S P O O C C C C C C C C C H H H H H H H H H H H H H H H H H H H H H
charge: 0
multiplicity: 1
keywords: wb97x-d3
keywords: def2-TZVPP
keywords: def2/J RIJCOSX
keywords: DEFGRID2
keywords: scfconv7
keywords: smallprint printgap noloewdin
keywords: NOSOSCF
formula: C9H21O2PS3
InChI: InChI=1/C9H21O2PS3/c1-6-10-12(13,11-7-2)15-8-14-9(3,4)5/h6-8H2,1-5H3
36 atoms
S  1.726299 -1.108949 1.246167
S  0.465721 1.007726 -0.649963
S  -2.51845 0.951732 -1.964518
P  -1.554274 0.629559 -0.33243
O  -1.656799 -0.825471 0.320595
O  -1.995853 1.441503 0.973054
C  3.198993 -1.375547 0.160874
C  3.915878 -2.561906 0.799617
C  2.764103 -1.739036 -1.25365
C  4.112956 -0.160514 0.151584
C  1.219963 0.588254 0.968657
C  -1.404735 -1.992858 -0.484673
C  -2.557472 2.76673 0.902233
C  -1.491005 -3.206706 0.401268
C  -1.543692 3.826437 0.547386
H  4.773058 -2.844743 0.184694
H  4.283897 -2.323886 1.798352
H  3.268073 -3.437701 0.875809
H  2.209798 -0.932734 -1.732368
H  2.136481 -2.630943 -1.261264
H  3.643805 -1.945636 -1.869301
H  4.388736 0.151022 1.160056
H  5.033294 -0.406412 -0.383366
H  3.670697 0.693703 -0.363379
H  0.520573 0.837289 1.766821
H  2.058581 1.27436 1.079722
H  -2.145958 -2.039974 -1.28563
H  -0.414381 -1.918386 -0.940564
H  -3.388668 2.768946 0.194235
H  -2.965893 2.941227 1.896537
H  -0.737717 -3.180362 1.18833
H  -2.476254 -3.303401 0.858442
H  -1.315452 -4.09827 -0.201561
H  -2.016233 4.805049 0.643902
H  -0.683728 3.804973 1.217208
H  -1.189507 3.734085 -0.479035
elementType: S P O C H
totalener: -2042.20039774 hartree
nucrepener: 1718.78552926 hartree
electener: -3760.98592700 hartree
oneelecener: -6232.64112520 hartree
twoeener: 2471.65519820 hartree
cpcmener: -0.01705580 hartree
kineticenergy: 2036.96451700 hartree
xcener: -124.859165657066 hartree
chargesum: -0.0000000
charge: -0.161964 -0.157205 -0.448478 0.628885 -0.334119 -0.343591 0.193528 -0.290664 -0.344062 -0.326318 -0.145382 0.000094 0.037890 -0.240946 -0.249802 0.097067 0.101434 0.103573 0.101904 0.097670 0.109015 0.105014 0.104472 0.092665 0.154885 0.156176 0.119632 0.097605 0.094580 0.109872 0.081017 0.092935 0.088790 0.103013 0.090738 0.080078
qa: -0.1620 -0.1572 -0.4485 0.6289 -0.3341 -0.3436 0.1935 -0.2907 -0.3441 -0.3263 -0.1454 0.0001 0.0379 -0.2409 -0.2498 0.0971 0.1014 0.1036 0.1019 0.0977 0.1090 0.1050 0.1045 0.0927 0.1549 0.1562 0.1196 0.0976 0.0946 0.1099 0.0810 0.0929 0.0888 0.1030 0.0907 0.0801
va: 2.2558 2.2913 2.0211 5.4571 2.1003 2.0948 3.8401 3.8832 3.9285 3.9276 4.0183 3.8391 3.8418 3.9451 3.8975 1.0046 1.0139 1.0087 1.0166 1.0060 1.0075 1.0094 1.0041 0.9967 1.0170 0.9960 1.0120 0.9910 1.0136 0.9918 1.0163 1.0051 1.0055 1.0112 1.0048 1.0159
dispcorr: -0.018672685 hartree
energy: -2042.219070427024
dipole: 18.81644 -17.21818 1.59825 -8.27523 8.32345 0.04822 4.61286 -3.69992 0.91295
magnitude: 1.84125 au
magnitude: 4.68010 debye
