program: Orca
programVersion: 5.0.2
elementType: S S S P O O C C C C C C C C C H H H H H H H H H H H H H H H H H H H H H
charge: 0
multiplicity: 1
keywords: wb97x-d3
keywords: def2-TZVPP
keywords: def2/J RIJCOSX
keywords: DEFGRID2
keywords: scfconv7
keywords: smallprint printgap noloewdin
keywords: NOSOSCF
formula: C9H21O2PS3
InChI: InChI=1/C9H21O2PS3/c1-6-10-12(13,11-7-2)15-8-14-9(3,4)5/h6-8H2,1-5H3
36 atoms
S  1.751817 -1.233734 -0.852514
S  0.739504 1.340965 0.537881
S  -1.345052 1.444425 -2.171519
P  -1.147222 1.033436 -0.30247
O  -1.57212 -0.483322 -0.026323
O  -1.944318 1.937401 0.752443
C  3.08651 -1.786059 0.293843
C  2.863393 -1.261062 1.704096
C  2.976937 -3.307998 0.274916
C  4.447028 -1.354041 -0.234721
C  1.783885 0.557848 -0.742744
C  -1.562134 -1.075979 1.286205
C  -3.202162 2.566606 0.438068
C  -1.504705 -2.572454 1.129921
C  -4.343209 1.583774 0.365878
H  1.879986 -1.535474 2.087196
H  3.6154 -1.685587 2.374294
H  2.960354 -0.176327 1.762789
H  3.107949 -3.714007 -0.729888
H  2.014339 -3.650736 0.657994
H  3.756911 -3.737729 0.906835
H  4.554184 -0.268416 -0.261153
H  5.237291 -1.735862 0.416341
H  4.626223 -1.735756 -1.240024
H  2.79215 0.926085 -0.552384
H  1.482042 0.956775 -1.711702
H  -0.700888 -0.719562 1.855609
H  -2.46649 -0.772299 1.816227
H  -3.359379 3.285503 1.240353
H  -3.101548 3.121935 -0.496251
H  -2.358419 -2.952419 0.568992
H  -0.589565 -2.882369 0.626469
H  -1.523008 -3.036274 2.116648
H  -4.234549 0.885454 -0.464251
H  -4.447053 1.017556 1.291558
H  -5.27136 2.134252 0.209394
elementType: S P O C H
totalener: -2042.19976842 hartree
nucrepener: 1718.74805156 hartree
electener: -3760.94781998 hartree
oneelecener: -6232.87478877 hartree
twoeener: 2471.92696879 hartree
cpcmener: -0.01973141 hartree
kineticenergy: 2036.97251246 hartree
xcener: -124.858292716993 hartree
chargesum: -0.0000000
charge: -0.168891 -0.155590 -0.444254 0.621563 -0.318442 -0.351338 0.189373 -0.330898 -0.296661 -0.318589 -0.155664 0.005792 0.035843 -0.231677 -0.248046 0.101577 0.107332 0.090601 0.106204 0.107933 0.099665 0.100643 0.098603 0.098070 0.152746 0.160289 0.099010 0.116098 0.106804 0.093988 0.094984 0.068831 0.089862 0.084176 0.088601 0.101462
qa: -0.1689 -0.1556 -0.4443 0.6216 -0.3184 -0.3513 0.1894 -0.3309 -0.2967 -0.3186 -0.1557 0.0058 0.0358 -0.2317 -0.2480 0.1016 0.1073 0.0906 0.1062 0.1079 0.0997 0.1006 0.0986 0.0981 0.1527 0.1603 0.0990 0.1161 0.1068 0.0940 0.0950 0.0688 0.0899 0.0842 0.0886 0.1015
va: 2.2368 2.2920 2.0235 5.4230 2.0682 2.0769 3.8603 3.9403 3.8784 3.9296 3.9963 3.8475 3.8627 3.9362 3.8954 1.0034 1.0072 1.0010 1.0095 1.0038 1.0044 1.0045 1.0034 1.0144 1.0042 1.0229 1.0015 0.9958 0.9908 1.0112 1.0062 1.0227 1.0067 1.0176 1.0044 1.0105
dispcorr: -0.018651703 hartree
energy: -2042.218420124671
dipole: 7.92790 -7.44798 0.47992 -16.78461 16.21886 -0.56575 12.74898 -10.58118 2.16780
magnitude: 2.29124 au
magnitude: 5.82386 debye
