program: Gaussian 09
title: 000066787
version: EM64L-G09RevD.01
frameworkgroup: C1[X(C6H6O7S2)]
method: RPBEPBE
basis: SDD
operation: Freq
keyword: #pfreq=noraman
keyword: PBEPBE/SDD
title: #p freq=noraman PBEPBE/SDD
converged: YES YES NO NO
title: Mulliken charges:
elementType: S S O O O O O O O C C C C C C H H H H H H
charge: 1.018558 1.001435 -0.380491 -0.552095 -0.563201 -0.487290 -0.481611 -0.484817 -0.494791 -0.210736 -0.071536 -0.218282 0.391614 -0.188861 -0.317453 0.336500 0.293292 0.250831 0.382378 0.387405 0.389148
chargesum: 0.00000
title: Mulliken charges with hydrogens summed into heavy atoms:
elementType: S S O O O O O O O C C C C C C
charge: 1.018558 1.001435 0.001887 -0.164689 -0.174053 -0.487290 -0.481611 -0.484817 -0.494791 -0.210736 -0.071536 0.118219 0.391614 0.104431 -0.066622
polarizability: 1.92688406e+02 -5.66873379e+00 1.44848736e+02 -2.55816066e+00 -8.38727073e-01 9.14487286e+01
1716.lowfreq: -9.3954 -0.0025 -0.0019 0.0014 3.4319 4.4892 22.8413 41.9268 80.1348
frequency: 22.8253 41.8984 80.1341 89.7616 99.1711 123.2718 147.6815 165.8015 178.1015 199.7014 222.5463 238.0788 249.2470 284.1974 295.1516 310.8341 334.0086 348.6587 369.4007 373.0395 411.6642 425.4783 459.5980 486.0911 535.3386 548.2845 592.4187 613.9587 664.5855 738.3170 809.7100 826.0681 837.5342 841.0734 935.9733 958.4103 969.2527 973.3027 1005.7998 1051.2222 1066.8365 1072.4148 1099.6642 1157.2719 1256.9101 1276.6593 1385.2421 1411.0367 1469.8662 1577.7727 1611.4521 3140.2097 3142.1429 3168.4564 3479.2782 3482.0230 3583.5167
redmass: 9.1377 5.6890 4.9416 9.6538 5.6361 1.7431 6.9373 6.6711 2.6037 3.2571 6.3302 5.9866 4.4785 3.9830 7.7162 6.8897 9.2713 10.3257 1.4044 3.1607 11.5270 9.0891 3.7162 4.6586 9.0112 12.5636 5.6402 8.3564 8.7249 3.3659 6.7403 1.6052 11.3304 13.0049 1.3937 7.1053 3.0368 2.1342 5.4498 1.2343 1.7413 1.4082 1.5340 1.1599 1.3113 2.7644 4.1325 6.0994 2.8176 7.5187 7.1761 1.0905 1.0928 1.0963 1.0662 1.0662 1.0667
irintensity: 3.1751 5.3681 7.2760 1.7461 2.7824 79.7631 6.0967 6.1108 21.5630 30.6722 4.9194 7.4709 28.5150 58.6469 30.3910 17.8323 16.9285 0.0552 99.8176 22.2159 123.6166 39.9003 8.2928 38.5071 33.3875 247.0315 10.2652 39.2015 21.5406 0.4572 23.5426 50.7511 54.5696 106.2139 13.3814 68.0881 62.8105 35.4016 6.1925 54.8503 85.9595 46.3579 181.5246 8.4411 76.6548 35.1521 77.4000 1.0107 30.0459 25.9581 50.2045 0.7063 26.9029 6.6545 54.9328 60.5239 88.4452
temp: 298.150 k
press: 1.00000 atm
elementType: 16 16 8 8 8 8 8 8 8 6 6 6 6 6 6 1 1 1 1 1 1
symmnumber: 1
zpe: 318436.0 jmol-1
zpe.correction: 0.121286 hartree
zpe.thermalcorrener: 0.138130 hartree
zpe.thermalcorrenthalpy: 0.139075 hartree
zpe.thermalcorrgfe: 0.075980 hartree
zpe.sumelectzpe: -1553.417397 hartree
zpe.sumelectthermal: -1553.400553 hartree
zpe.sumelectthermalent: -1553.399608 hartree
zpe.sumelectthermalfe: -1553.462703 hartree
dipole: -1.0911 6.3320 0.4932
dipole: 6.4442
quadrupole: -106.8703 -90.8900 -109.0281
quadrupole: -10.1488 16.6602 -1.9862
quadrupole: -4.6075 11.3728 -6.7652 -10.1488 16.6602 -1.9862
hfenergy: -1553.5386831 hartree
pointgroup: C01 [X(C6H6O7S2)]
dipole: 0.4767523 2.4878792 -0.1053741 debye
dipolederiv: 1.8242679 -0.3597606 0.1357013 -0.4388691 1.4822603 0.0354617 0.1900204 0.0265634 1.545078 2.0393114 0.2678086 0.0830448 0.4356803 1.2919106 0.0682259 0.1975482 0.0987777 1.6424864 -1.0750378 -0.688096 -0.0259661 -0.5508993 -0.4048159 -0.0139332 -0.029346 -0.0202227 -0.3382912 -0.6004079 -0.0056449 -0.3287277 -0.0060516 -0.5359082 -0.0195232 -0.3798221 0.0235684 -0.8689922 -0.5682188 0.0423958 -0.1858748 -0.0099086 -0.512961 -0.1290826 -0.2901999 -0.1330076 -0.9904106 -0.5982777 0.0264904 -0.0263899 0.0841925 -0.6525391 -0.0303221 0.0088466 0.0074898 -0.4407396 -0.6862857 0.0716484 0.0959629 0.0941783 -0.4801389 0.0534067 0.0522686 0.0107244 -0.54849 -0.6403106 -0.0614499 -0.0329666 -0.1442113 -0.5942104 0.105417 -0.0161226 0.020357 -0.5019645 -0.7792022 0.0117024 0.0453728 0.0238853 -0.5441031 -0.0914834 0.0104315 -0.02712 -0.4907204 -0.2726299 -0.042595 0.001015 -0.1971469 -0.3404229 0.0062733 0.0895529 -0.047676 -0.1822367 -0.271566 0.0722676 0.0078663 -0.0340571 -0.3002047 0.002548 0.1214351 0.0636656 -0.1702588 0.1238464 -0.0780764 0.0013092 0.0247435 -0.1888812 0.0010411 -0.0074581 -0.0189909 0.0013452 0.9418457 0.8301673 0.0176047 0.328336 0.4965923 0.0140566 0.0200696 0.022161 0.1420544 -0.0444562 0.0016861 -0.0040476 0.2230111 0.2280558 0.0080276 -0.0056462 0.0106999 -0.0360524 -0.4445696 -0.2448288 -0.0135576 0.1377482 0.0254582 0.0084059 -0.0196026 -0.0016471 -0.1631702 0.2337815 -0.007727 0.0151287 -0.0312246 0.1468237 -0.0054975 0.0128819 0.0037966 0.1489803 0.0955612 0.061104 0.0061122 0.0283781 0.1329079 0.0049725 0.0091943 -0.0042065 0.1531139 0.0111316 -0.0527759 -0.0045884 -0.0333908 -0.0612844 -0.0059068 0.0028942 -0.0065586 0.1779963 0.3646161 0.1946458 0.0017368 0.1485969 0.1983813 0.0026944 0.0042966 0.0009725 0.3833194 0.1681967 0.0670832 0.1197517 0.0264981 0.3238691 -0.0612097 0.0389936 -0.0242269 0.2600696 0.1784039 -0.106045 0.0915125 -0.1094891 0.2892106 0.0464281 -0.0102362 -0.0051201 0.2768832 unknown
polarizability: 192.8265906|4.8105744|144.5958282|3.0818328|2.4920484|91.563452 unknown
InChI: InChI=1S/C6H6O7S2/c7-5-2-1-4(14(8,9)10)3-6(5)15(11,12)13/h1-3,7-8,11H
charge 0 multiplicity 1
21 atoms
S  2.518455 -1.076999 0.004074
S  -3.048183 -0.499552 0.000622
O  2.451276 1.991579 0.093873
O  3.084545 -0.672632 1.71753
O  -3.143038 -0.66545 -1.844121
O  1.940657 -2.584894 -0.031149
O  3.662938 -0.635657 -1.045321
O  -2.999638 -1.977742 0.652289
O  -4.132914 0.595607 0.488718
C  1.022624 0.065743 0.034688
C  -1.351142 0.276908 0.011122
C  -0.228658 -0.56304 0.008659
C  1.172146 1.473776 0.063934
C  -1.269988 1.679173 0.037823
C  0.001501 2.278902 0.068608
H  -0.306079 -1.656966 0.002227
H  -2.183795 2.281499 0.04992
H  0.091392 3.371001 0.095331
H  2.459545 2.981052 0.103335
H  4.070028 -0.847923 1.749342
H  -3.972273 -1.182286 -2.065005
