program: Orca
programVersion: 5.0.2
elementType: S S S P O O C C C C C C C C C H H H H H H H H H H H H H H H H H H H H H
charge: 0
multiplicity: 1
keywords: wb97x-d3
keywords: def2-TZVPP
keywords: def2/J RIJCOSX
keywords: DEFGRID2
keywords: scfconv7
keywords: smallprint printgap noloewdin
keywords: NOSOSCF
formula: C9H21O2PS3
InChI: InChI=1/C9H21O2PS3/c1-6-10-12(13,11-7-2)15-8-14-9(3,4)5/h6-8H2,1-5H3
36 atoms
S  1.706762 -1.588829 0.869654
S  -0.178323 0.595048 1.704143
S  -0.064975 2.133714 -1.326868
P  -1.044953 0.948937 -0.170477
O  -1.333384 -0.448733 -0.870627
O  -2.504857 1.404573 0.294401
C  2.918522 -1.621541 -0.521626
C  3.226522 -3.104019 -0.711065
C  2.292487 -1.054415 -1.787465
C  4.185465 -0.864888 -0.148681
C  1.525793 0.177087 1.226312
C  -2.096704 -1.505751 -0.249756
C  -2.798067 2.732883 0.770252
C  -1.683291 -2.819513 -0.859915
C  -4.208623 3.080767 0.37307
H  2.331368 -3.678774 -0.956618
H  3.929469 -3.226228 -1.537804
H  3.680771 -3.54392 0.178158
H  1.393464 -1.603513 -2.069528
H  3.002718 -1.125094 -2.615574
H  2.022491 -0.002806 -1.683903
H  4.632454 -1.256899 0.764682
H  4.922299 -0.957379 -0.949971
H  4.002179 0.200744 -0.005611
H  2.142283 0.471331 2.074744
H  1.817386 0.795354 0.375313
H  -1.922063 -1.514908 0.828765
H  -3.156492 -1.309686 -0.420807
H  -2.679678 2.74482 1.855117
H  -2.088707 3.445606 0.343911
H  -2.297489 -3.615778 -0.43761
H  -1.826662 -2.827344 -1.941089
H  -0.640034 -3.046105 -0.640093
H  -4.92976 2.377212 0.790441
H  -4.452835 4.073045 0.75321
H  -4.324193 3.098508 -0.710951
elementType: S P O C H
totalener: -2042.19977106 hartree
nucrepener: 1716.59969901 hartree
electener: -3758.79947007 hartree
oneelecener: -6228.59412726 hartree
twoeener: 2469.79465719 hartree
cpcmener: -0.01642558 hartree
kineticenergy: 2036.95732168 hartree
xcener: -124.855517019441 hartree
chargesum: 0.0000000
charge: -0.185421 -0.166068 -0.438663 0.638883 -0.324423 -0.344493 0.196579 -0.295947 -0.324923 -0.319372 -0.100493 0.005052 0.033291 -0.229353 -0.236759 0.107592 0.098265 0.103577 0.094795 0.105014 0.084351 0.099357 0.099982 0.098252 0.158471 0.118167 0.102197 0.110951 0.102299 0.089451 0.096445 0.092252 0.067396 0.088799 0.087906 0.086592
qa: -0.1854 -0.1661 -0.4387 0.6389 -0.3244 -0.3445 0.1966 -0.2959 -0.3249 -0.3194 -0.1005 0.0051 0.0333 -0.2294 -0.2368 0.1076 0.0983 0.1036 0.0948 0.1050 0.0844 0.0994 0.1000 0.0983 0.1585 0.1182 0.1022 0.1110 0.1023 0.0895 0.0964 0.0923 0.0674 0.0888 0.0879 0.0866
va: 2.2042 2.2901 2.0238 5.4387 2.0996 2.1071 3.8633 3.8746 3.9349 3.9275 3.9714 3.8582 3.8473 3.9160 3.9615 1.0041 1.0040 1.0121 1.0102 1.0100 1.0230 1.0126 1.0045 1.0000 0.9973 1.0356 1.0033 0.9988 0.9923 1.0097 1.0097 1.0043 1.0259 1.0037 1.0074 1.0071
dispcorr: -0.018537288 hartree
energy: -2042.218308352472
dipole: 6.10639 -6.35904 -0.25266 -11.42388 10.94255 -0.48133 -5.29847 6.05749 0.75901
magnitude: 0.93361 au
magnitude: 2.37304 debye
