program: Orca
programVersion: 5.0.2
elementType: S S S P O O C C C C C C C C C H H H H H H H H H H H H H H H H H H H H H
charge: 0
multiplicity: 1
keywords: wb97x-d3
keywords: def2-TZVPP
keywords: def2/J RIJCOSX
keywords: DEFGRID2
keywords: scfconv7
keywords: smallprint printgap noloewdin
keywords: NOSOSCF
formula: C9H21O2PS3
InChI: InChI=1/C9H21O2PS3/c1-6-10-12(13,11-7-2)15-8-14-9(3,4)5/h6-8H2,1-5H3
36 atoms
S  2.867205 0.275008 0.852468
S  -0.114504 0.356808 1.214569
S  -1.109957 0.292926 -2.047792
P  -1.659263 0.351582 -0.19754
O  -2.559273 -0.848394 0.355118
O  -2.680566 1.516943 0.192108
C  3.103714 -1.165694 -0.277315
C  3.366283 -0.682415 -1.697109
C  4.342271 -1.864134 0.276303
C  1.909644 -2.108085 -0.240427
C  1.328541 1.011481 0.294659
C  -2.124272 -2.217141 0.251041
C  -2.628879 2.827544 -0.397554
C  -3.266171 -3.104622 0.673695
C  -1.426107 3.630204 0.036449
H  3.545942 -1.538488 -2.352843
H  2.51639 -0.137641 -2.111926
H  4.24071 -0.032823 -1.74536
H  4.585242 -2.725131 -0.349915
H  4.183605 -2.228682 1.292491
H  5.214361 -1.207378 0.281445
H  1.68303 -2.43463 0.774507
H  1.01322 -1.652353 -0.662772
H  2.131148 -2.996148 -0.838316
H  1.395358 2.082597 0.479331
H  1.171785 0.862939 -0.774742
H  -1.82854 -2.429908 -0.779073
H  -1.253544 -2.371131 0.892579
H  -2.666021 2.738372 -1.485363
H  -3.549584 3.309382 -0.071676
H  -3.572101 -2.905169 1.701129
H  -4.131239 -2.984601 0.021162
H  -2.946284 -4.145349 0.617055
H  -0.494584 3.236487 -0.37231
H  -1.533863 4.64991 -0.336087
H  -1.341198 3.679052 1.122114
elementType: S P O C H
totalener: -2042.19902949 hartree
nucrepener: 1705.69478254 hartree
electener: -3747.89381203 hartree
oneelecener: -6206.32639870 hartree
twoeener: 2458.43258666 hartree
cpcmener: -0.01616864 hartree
kineticenergy: 2036.95294489 hartree
xcener: -124.857003666154 hartree
chargesum: -0.0000000
charge: -0.167667 -0.163442 -0.448667 0.647199 -0.339142 -0.346365 0.190125 -0.319791 -0.292103 -0.300323 -0.120441 0.041652 0.036237 -0.247520 -0.254218 0.099899 0.099192 0.097888 0.097972 0.104997 0.104441 0.100836 0.050850 0.104800 0.164438 0.120891 0.097561 0.095023 0.094963 0.108864 0.088789 0.089788 0.087227 0.076174 0.104400 0.095471
qa: -0.1677 -0.1634 -0.4487 0.6472 -0.3391 -0.3464 0.1901 -0.3198 -0.2921 -0.3003 -0.1204 0.0417 0.0362 -0.2475 -0.2542 0.0999 0.0992 0.0979 0.0980 0.1050 0.1044 0.1008 0.0508 0.1048 0.1644 0.1209 0.0976 0.0950 0.0950 0.1089 0.0888 0.0898 0.0872 0.0762 0.1044 0.0955
va: 2.2420 2.2983 1.9982 5.4370 2.1238 2.1182 3.8775 3.9498 3.8669 3.9135 3.9859 3.8355 3.8588 3.9781 3.8891 1.0028 1.0007 1.0137 1.0038 1.0114 1.0101 1.0133 1.0273 1.0101 0.9921 1.0482 0.9980 0.9938 1.0111 0.9919 1.0038 1.0052 1.0056 1.0095 1.0115 1.0056
dispcorr: -0.018378045 hartree
energy: -2042.217407533314
dipole: 10.42766 -10.12473 0.30294 -8.84892 8.64758 -0.20134 -3.28412 3.18199 -0.10213
magnitude: 0.37780 au
magnitude: 0.96030 debye
