program: Orca
programVersion: 5.0.2
elementType: S S S P O O C C C C C C C C C H H H H H H H H H H H H H H H H H H H H H
charge: 0
multiplicity: 1
keywords: wb97x-d3
keywords: def2-TZVPP
keywords: def2/J RIJCOSX
keywords: DEFGRID2
keywords: scfconv7
keywords: smallprint printgap noloewdin
keywords: NOSOSCF
formula: C9H21O2PS3
InChI: InChI=1/C9H21O2PS3/c1-6-10-12(13,11-7-2)15-8-14-9(3,4)5/h6-8H2,1-5H3
36 atoms
S  2.058879 -0.264818 1.133571
S  0.297141 0.088174 -1.40192
S  -2.990367 -0.116644 -1.515953
P  -1.499789 0.488646 -0.45375
O  -1.427162 -0.086098 1.040108
O  -1.372527 2.057291 -0.174663
C  3.408091 -1.316342 0.444097
C  4.60277 -0.463004 0.041833
C  3.786464 -2.228302 1.607748
C  2.918863 -2.147254 -0.733572
C  1.552648 0.7655 -0.24281
C  -1.972851 -1.363117 1.417125
C  -2.484183 2.806669 0.367121
C  -1.169176 -2.531784 0.902303
C  -3.015487 3.755632 -0.675769
H  4.974016 0.128876 0.878737
H  5.416859 -1.10518 -0.303968
H  4.368643 0.218375 -0.777496
H  2.950928 -2.855557 1.922525
H  4.132397 -1.662211 2.474458
H  4.59905 -2.890327 1.301564
H  2.667766 -1.532044 -1.598372
H  3.709605 -2.832493 -1.049573
H  2.042227 -2.741755 -0.475723
H  1.187284 1.70839 0.159781
H  2.402759 1.016979 -0.876752
H  -1.977426 -1.348547 2.506429
H  -3.009608 -1.424272 1.079834
H  -3.272495 2.137969 0.720291
H  -2.097119 3.342858 1.233327
H  -1.585022 -3.450968 1.317549
H  -1.21194 -2.61314 -0.184107
H  -0.125069 -2.46256 1.205281
H  -3.425045 3.217107 -1.530309
H  -3.814909 4.35842 -0.243281
H  -2.239747 4.434641 -1.030618
elementType: S P O C H
totalener: -2042.19918743 hartree
nucrepener: 1706.47037088 hartree
electener: -3748.66955831 hartree
oneelecener: -6208.28961625 hartree
twoeener: 2459.62005794 hartree
cpcmener: -0.01770620 hartree
kineticenergy: 2036.95433360 hartree
xcener: -124.856111089680 hartree
chargesum: 0.0000000
charge: -0.163843 -0.142662 -0.458817 0.642872 -0.339560 -0.351200 0.191339 -0.320968 -0.295199 -0.332087 -0.162309 0.036148 0.039844 -0.237473 -0.232117 0.097852 0.098811 0.102136 0.107702 0.104725 0.098645 0.090519 0.106113 0.104707 0.160357 0.152866 0.108855 0.095092 0.086698 0.103787 0.101981 0.073934 0.075393 0.075780 0.091684 0.088398
qa: -0.1638 -0.1427 -0.4588 0.6429 -0.3396 -0.3512 0.1913 -0.3210 -0.2952 -0.3321 -0.1623 0.0361 0.0398 -0.2375 -0.2321 0.0979 0.0988 0.1021 0.1077 0.1047 0.0986 0.0905 0.1061 0.1047 0.1604 0.1529 0.1089 0.0951 0.0867 0.1038 0.1020 0.0739 0.0754 0.0758 0.0917 0.0884
va: 2.2371 2.2974 1.9957 5.4174 2.0712 2.0858 3.8527 3.9313 3.8723 3.9438 4.0278 3.8414 3.8716 3.8960 3.9371 1.0141 1.0033 1.0031 1.0057 1.0102 1.0042 0.9998 1.0062 1.0038 1.0162 1.0051 0.9913 1.0159 1.0064 0.9955 1.0150 1.0190 1.0213 1.0169 1.0083 1.0042
dispcorr: -0.018248921 hartree
energy: -2042.217436352345
dipole: 16.31012 -14.94570 1.36442 -6.24247 6.39561 0.15314 7.63236 -6.42215 1.21021
magnitude: 1.83022 au
magnitude: 4.65205 debye
