program: Orca
programVersion: 5.0.2
elementType: S S S P O O C C C C C C C C C H H H H H H H H H H H H H H H H H H H H H
charge: 0
multiplicity: 1
keywords: wb97x-d3
keywords: def2-TZVPP
keywords: def2/J RIJCOSX
keywords: DEFGRID2
keywords: scfconv7
keywords: smallprint printgap noloewdin
keywords: NOSOSCF
formula: C9H21O2PS3
InChI: InChI=1/C9H21O2PS3/c1-6-10-12(13,11-7-2)15-8-14-9(3,4)5/h6-8H2,1-5H3
36 atoms
S  1.731397 -1.571665 0.297016
S  -0.33685 0.134931 1.567421
S  -0.144634 2.034535 -1.260526
P  -1.150902 0.724287 -0.273613
O  -1.46289 -0.563276 -1.151665
O  -2.610202 1.161194 0.217777
C  3.3125 -1.259901 -0.599393
C  3.699533 -2.628406 -1.151938
C  3.091874 -0.276948 -1.739962
C  4.382449 -0.754435 0.358063
C  1.421592 -0.004968 1.144857
C  -1.899773 -1.84894 -0.66775
C  -2.854901 2.393836 0.921524
C  -3.358997 -1.882607 -0.28438
C  -4.19769 2.929396 0.497134
H  2.927946 -3.035645 -1.808315
H  4.615433 -2.53897 -1.739907
H  3.884305 -3.35077 -0.355339
H  2.334198 -0.63758 -2.436022
H  4.022694 -0.138117 -2.296094
H  2.776825 0.704799 -1.385051
H  4.138957 0.228289 0.765178
H  4.532594 -1.440265 1.192623
H  5.334068 -0.655556 -0.170497
H  1.949998 0.053995 2.096645
H  1.708887 0.854228 0.537496
H  -1.705273 -2.52703 -1.497347
H  -1.267283 -2.160139 0.165308
H  -2.834944 2.186074 1.992779
H  -2.064468 3.115449 0.701891
H  -3.643979 -2.920946 -0.109111
H  -3.56568 -1.329092 0.630571
H  -3.994486 -1.494201 -1.080553
H  -4.211657 3.17325 -0.565358
H  -4.99809 2.218112 0.703159
H  -4.412164 3.841971 1.054157
elementType: S P O C H
totalener: -2042.19883063 hartree
nucrepener: 1709.69745435 hartree
electener: -3751.89628498 hartree
oneelecener: -6214.92806092 hartree
twoeener: 2463.03177595 hartree
cpcmener: -0.01749693 hartree
kineticenergy: 2036.95724397 hartree
xcener: -124.857294749891 hartree
chargesum: 0.0000000
charge: -0.190334 -0.165377 -0.441895 0.635672 -0.330969 -0.342048 0.200572 -0.288989 -0.319209 -0.324644 -0.109118 0.027646 0.028604 -0.238613 -0.237596 0.104666 0.096869 0.103178 0.093956 0.102206 0.091855 0.096383 0.100391 0.101374 0.153587 0.128301 0.112027 0.084986 0.102216 0.092555 0.097854 0.077747 0.093376 0.086002 0.089020 0.087747
qa: -0.1903 -0.1654 -0.4419 0.6357 -0.3310 -0.3420 0.2006 -0.2890 -0.3192 -0.3246 -0.1091 0.0276 0.0286 -0.2386 -0.2376 0.1047 0.0969 0.1032 0.0940 0.1022 0.0919 0.0964 0.1004 0.1014 0.1536 0.1283 0.1120 0.0850 0.1022 0.0926 0.0979 0.0777 0.0934 0.0860 0.0890 0.0877
va: 2.2157 2.2943 2.0201 5.4440 2.1106 2.0941 3.8639 3.8650 3.9442 3.9278 3.9959 3.8655 3.8436 3.9317 3.9685 1.0103 1.0044 1.0122 1.0150 1.0076 1.0069 1.0017 1.0116 1.0041 0.9973 1.0257 0.9883 1.0060 0.9925 1.0098 1.0078 1.0134 1.0062 1.0077 1.0030 1.0071
dispcorr: -0.017649740 hartree
energy: -2042.216480366734
dipole: 6.89627 -6.80948 0.08680 -6.48625 5.94192 -0.54433 -1.47967 2.61902 1.13935
magnitude: 1.26568 au
magnitude: 3.21710 debye
