program: Orca
programVersion: 5.0.2
elementType: S S S P O O C C C C C C C C C H H H H H H H H H H H H H H H H H H H H H
charge: 0
multiplicity: 1
keywords: wb97x-d3
keywords: def2-TZVPP
keywords: def2/J RIJCOSX
keywords: DEFGRID2
keywords: scfconv7
keywords: smallprint printgap noloewdin
keywords: NOSOSCF
formula: C9H21O2PS3
InChI: InChI=1/C9H21O2PS3/c1-6-10-12(13,11-7-2)15-8-14-9(3,4)5/h6-8H2,1-5H3
36 atoms
S  1.848726 -0.44634 1.284766
S  0.287569 0.555758 -1.205005
S  -2.898469 0.098101 -1.760908
P  -1.606546 0.383734 -0.362658
O  -1.486925 -0.705848 0.798131
O  -1.830614 1.632852 0.607231
C  3.376648 -1.093588 0.480074
C  3.096362 -1.58093 -0.933553
C  4.474267 -0.039275 0.480389
C  3.778392 -2.2678 1.370485
C  1.336231 0.930924 0.252667
C  -1.301564 -2.099156 0.484059
C  -2.386181 2.882241 0.161599
C  -2.604222 -2.851851 0.592664
C  -1.411154 3.712393 -0.636277
H  2.815087 -0.767129 -1.602615
H  3.996963 -2.040582 -1.34874
H  2.299953 -2.325018 -0.953194
H  4.682293 0.325561 1.486523
H  4.225572 0.818187 -0.147125
H  5.396865 -0.467667 0.080303
H  3.974009 -1.952392 2.397096
H  3.008997 -3.041859 1.393082
H  4.693544 -2.722237 0.98536
H  0.807419 1.636207 0.892648
H  2.198048 1.4677 -0.144677
H  -0.863112 -2.216494 -0.510495
H  -0.569596 -2.468307 1.200859
H  -3.297106 2.690792 -0.409675
H  -2.670252 3.397213 1.07835
H  -3.035229 -2.762685 1.590489
H  -3.334676 -2.499506 -0.13546
H  -2.422229 -3.910327 0.40151
H  -1.168336 3.257916 -1.596096
H  -1.864614 4.68381 -0.836947
H  -0.484032 3.88465 -0.088431
elementType: S P O C H
totalener: -2042.20022260 hartree
nucrepener: 1713.97630584 hartree
electener: -3756.17652844 hartree
oneelecener: -6223.10425548 hartree
twoeener: 2466.92772704 hartree
cpcmener: -0.01821780 hartree
kineticenergy: 2036.96367633 hartree
xcener: -124.859736070722 hartree
chargesum: 0.0000000
charge: -0.161265 -0.152337 -0.450446 0.622380 -0.336680 -0.340685 0.192311 -0.328915 -0.324858 -0.294968 -0.149545 0.047974 0.038440 -0.238957 -0.258183 0.092445 0.104971 0.102293 0.098494 0.101184 0.099258 0.104720 0.105409 0.098415 0.153102 0.157078 0.083148 0.094077 0.093188 0.109664 0.088787 0.076414 0.092523 0.083393 0.105105 0.092064
qa: -0.1613 -0.1523 -0.4504 0.6224 -0.3367 -0.3407 0.1923 -0.3289 -0.3249 -0.2950 -0.1495 0.0480 0.0384 -0.2390 -0.2582 0.0924 0.1050 0.1023 0.0985 0.1012 0.0993 0.1047 0.1054 0.0984 0.1531 0.1571 0.0831 0.0941 0.0932 0.1097 0.0888 0.0764 0.0925 0.0834 0.1051 0.0921
va: 2.2494 2.2851 2.0140 5.4635 2.0916 2.0986 3.8540 3.9339 3.9298 3.8699 4.0066 3.8475 3.8433 3.9745 3.9014 1.0008 1.0062 1.0094 1.0144 1.0028 1.0030 1.0104 1.0103 1.0043 1.0191 1.0023 1.0072 1.0030 1.0147 0.9915 1.0041 1.0198 1.0066 1.0147 1.0121 1.0027
dispcorr: -0.018253112 hartree
energy: -2042.218475711345
dipole: 19.20329 -17.27212 1.93117 -4.99889 5.38625 0.38736 4.66481 -4.09303 0.57177
magnitude: 2.05095 au
magnitude: 5.21310 debye
