program: Orca
programVersion: 5.0.2
elementType: S S S P O O C C C C C C C C C H H H H H H H H H H H H H H H H H H H H H
charge: 0
multiplicity: 1
keywords: wb97x-d3
keywords: def2-TZVPP
keywords: def2/J RIJCOSX
keywords: DEFGRID2
keywords: scfconv7
keywords: smallprint printgap noloewdin
keywords: NOSOSCF
formula: C9H21O2PS3
InChI: InChI=1/C9H21O2PS3/c1-6-10-12(13,11-7-2)15-8-14-9(3,4)5/h6-8H2,1-5H3
36 atoms
S  1.910945 -1.007083 1.282822
S  0.417079 0.729574 -0.825228
S  -2.686816 0.778925 -1.821688
P  -1.58077 0.601264 -0.256731
O  -1.768975 -0.696871 0.650364
O  -1.772043 1.665968 0.922812
C  3.347668 -1.383618 0.181498
C  4.118799 -2.457041 0.945519
C  2.867854 -1.941278 -1.152314
C  4.226932 -0.161108 -0.028479
C  1.314742 0.605226 0.772604
C  -2.182203 -1.966357 0.110635
C  -1.677913 3.07959 0.650896
C  -1.091922 -2.660992 -0.66727
C  -3.047392 3.708699 0.612846
H  4.511495 -2.079442 1.890371
H  3.499491 -3.330355 1.159463
H  4.964204 -2.79707 0.343739
H  2.257681 -2.834474 -1.014914
H  3.727169 -2.215784 -1.769722
H  2.278271 -1.216845 -1.713034
H  5.135977 -0.45619 -0.557673
H  3.742348 0.602023 -0.639198
H  4.526509 0.293599 0.91671
H  0.667463 0.958348 1.575277
H  2.130731 1.322956 0.704335
H  -2.467831 -2.552403 0.983139
H  -3.074425 -1.824304 -0.502698
H  -1.074411 3.498459 1.455844
H  -1.140308 3.2588 -0.283787
H  -0.847544 -2.138693 -1.592439
H  -0.182612 -2.760353 -0.075476
H  -1.437622 -3.660521 -0.934801
H  -2.942678 4.784671 0.466041
H  -3.646547 3.314334 -0.207459
H  -3.586734 3.550236 1.546955
elementType: S P O C H
totalener: -2042.19870053 hartree
nucrepener: 1708.94238996 hartree
electener: -3751.14109049 hartree
oneelecener: -6213.01505726 hartree
twoeener: 2461.87396677 hartree
cpcmener: -0.01750061 hartree
kineticenergy: 2036.95907135 hartree
xcener: -124.858731411736 hartree
chargesum: 0.0000000
charge: -0.157754 -0.158379 -0.449181 0.630360 -0.336741 -0.344905 0.186566 -0.291241 -0.341034 -0.324650 -0.151271 0.034861 0.043270 -0.243803 -0.235711 0.101504 0.104208 0.097269 0.099733 0.106604 0.101532 0.104495 0.093129 0.105289 0.155635 0.157969 0.109625 0.095017 0.106534 0.083797 0.077471 0.076989 0.104910 0.092980 0.076187 0.088735
qa: -0.1578 -0.1584 -0.4492 0.6304 -0.3367 -0.3449 0.1866 -0.2912 -0.3410 -0.3247 -0.1513 0.0349 0.0433 -0.2438 -0.2357 0.1015 0.1042 0.0973 0.0997 0.1066 0.1015 0.1045 0.0931 0.1053 0.1556 0.1580 0.1096 0.0950 0.1065 0.0838 0.0775 0.0770 0.1049 0.0930 0.0762 0.0887
va: 2.2581 2.2839 2.0138 5.4585 2.1054 2.0914 3.8588 3.8808 3.9395 3.9285 4.0210 3.8492 3.8468 3.8788 3.9502 1.0140 1.0082 1.0047 1.0033 1.0074 1.0127 1.0043 0.9968 1.0101 1.0125 0.9970 0.9911 1.0151 0.9911 1.0114 1.0147 1.0264 1.0132 1.0072 1.0196 1.0041
dispcorr: -0.018598702 hartree
energy: -2042.217299233351
dipole: 17.70445 -16.01971 1.68475 -6.80338 6.90945 0.10607 2.43025 -1.68783 0.74242
magnitude: 1.84413 au
magnitude: 4.68740 debye
