program: Orca
programVersion: 5.0.2
elementType: S S S P O O C C C C C C C C C H H H H H H H H H H H H H H H H H H H H H
charge: 0
multiplicity: 1
keywords: wb97x-d3
keywords: def2-TZVPP
keywords: def2/J RIJCOSX
keywords: DEFGRID2
keywords: scfconv7
keywords: smallprint printgap noloewdin
keywords: NOSOSCF
formula: C9H21O2PS3
InChI: InChI=1/C9H21O2PS3/c1-6-10-12(13,11-7-2)15-8-14-9(3,4)5/h6-8H2,1-5H3
36 atoms
S  2.118099 0.170417 -0.953079
S  -0.152783 -1.089061 0.763149
S  -1.856686 0.336577 -1.816247
P  -1.70598 0.155783 0.097386
O  -2.974583 -0.434893 0.868973
O  -1.590232 1.491989 0.966319
C  3.547658 -0.177916 0.163559
C  4.08852 -1.582223 -0.062243
C  4.589368 0.855519 -0.258274
C  3.174357 0.027297 1.625057
C  0.965509 -1.175772 -0.67952
C  -3.897739 -1.357834 0.263134
C  -0.39916 2.294883 1.039641
C  -3.331954 -2.747042 0.095349
C  -0.257758 3.244293 -0.124103
H  5.006799 -1.71685 0.5145
H  3.393053 -2.353867 0.27087
H  4.322886 -1.762716 -1.111834
H  4.22253 1.876957 -0.140413
H  4.89823 0.721625 -1.296155
H  5.477822 0.752336 0.368265
H  2.800241 1.035649 1.806066
H  2.414085 -0.67884 1.958989
H  4.055516 -0.121052 2.255163
H  0.348366 -1.247182 -1.57578
H  1.482755 -2.129188 -0.578496
H  -4.751503 -1.370344 0.939254
H  -4.235993 -0.956362 -0.694335
H  -0.49349 2.843632 1.976055
H  0.48009 1.650031 1.121473
H  -2.962575 -3.152034 1.037542
H  -4.126038 -3.404353 -0.261918
H  -2.525723 -2.779029 -0.637638
H  -0.073573 2.721477 -1.06127
H  -1.142307 3.871056 -0.241669
H  0.593326 3.900254 0.064045
elementType: S P O C H
totalener: -2042.19629758 hartree
nucrepener: 1720.45490355 hartree
electener: -3762.65120114 hartree
oneelecener: -6236.21717932 hartree
twoeener: 2473.56597819 hartree
cpcmener: -0.01664014 hartree
kineticenergy: 2036.95961253 hartree
xcener: -124.860603120861 hartree
chargesum: -0.0000000
charge: -0.161002 -0.170699 -0.447846 0.645499 -0.351452 -0.341650 0.200171 -0.331761 -0.289952 -0.353448 -0.146364 0.036810 0.078369 -0.244119 -0.250528 0.101428 0.100156 0.103499 0.104209 0.104626 0.097569 0.103025 0.105023 0.110870 0.155075 0.159163 0.107607 0.094467 0.111083 0.039517 0.089026 0.101826 0.075340 0.071150 0.095910 0.097403
qa: -0.1610 -0.1707 -0.4478 0.6455 -0.3515 -0.3417 0.2002 -0.3318 -0.2900 -0.3534 -0.1464 0.0368 0.0784 -0.2441 -0.2505 0.1014 0.1002 0.1035 0.1042 0.1046 0.0976 0.1030 0.1050 0.1109 0.1551 0.1592 0.1076 0.0945 0.1111 0.0395 0.0890 0.1018 0.0753 0.0711 0.0959 0.0974
va: 2.2662 2.2826 1.9983 5.4275 2.1131 2.1217 3.8692 3.9248 3.8628 3.9239 3.9917 3.8567 3.8648 3.8893 3.9016 1.0035 0.9999 1.0135 1.0112 1.0121 1.0044 1.0047 1.0097 1.0073 1.0275 0.9994 0.9912 1.0126 0.9948 1.0281 1.0060 1.0106 1.0152 1.0233 1.0091 1.0088
dispcorr: -0.018500201 hartree
energy: -2042.214797785510
dipole: 19.53099 -18.25074 1.28026 -1.82956 0.97633 -0.85323 4.57653 -3.57114 1.00539
magnitude: 1.83790 au
magnitude: 4.67157 debye
