program: Orca
programVersion: 5.0.2
elementType: S S S P O O C C C C C C C C C H H H H H H H H H H H H H H H H H H H H H
charge: 0
multiplicity: 1
keywords: wb97x-d3
keywords: def2-TZVPP
keywords: def2/J RIJCOSX
keywords: DEFGRID2
keywords: scfconv7
keywords: smallprint printgap noloewdin
keywords: NOSOSCF
formula: C9H21O2PS3
InChI: InChI=1/C9H21O2PS3/c1-6-10-12(13,11-7-2)15-8-14-9(3,4)5/h6-8H2,1-5H3
36 atoms
S  2.976293 -0.308291 1.021098
S  -0.015651 -0.302413 1.291501
S  -1.00398 0.547103 -1.869552
P  -1.457721 0.463996 0.007536
O  -2.729214 -0.430021 0.391777
O  -1.796655 1.864513 0.699077
C  3.225073 -1.232859 -0.557944
C  4.457215 -2.091023 -0.287162
C  2.0279 -2.113222 -0.885602
C  3.507486 -0.261158 -1.695762
C  1.470626 0.62921 0.748758
C  -3.175554 -1.548831 -0.398409
C  -2.716575 2.801021 0.100184
C  -2.314765 -2.772984 -0.208825
C  -2.497316 4.149419 0.734533
H  4.703786 -2.664033 -1.183445
H  5.329818 -1.485287 -0.035298
H  4.289115 -2.801435 0.523835
H  1.134701 -1.527769 -1.105949
H  1.794253 -2.79916 -0.071584
H  2.250551 -2.70919 -1.774554
H  2.655748 0.386415 -1.909147
H  4.369155 0.371164 -1.480442
H  3.719909 -0.816803 -2.612552
H  1.537017 1.543238 1.336531
H  1.359147 0.910529 -0.299177
H  -4.194526 -1.735277 -0.061892
H  -3.217289 -1.257464 -1.449621
H  -2.545022 2.84832 -0.977586
H  -3.736582 2.448656 0.266926
H  -2.249936 -3.062688 0.84026
H  -2.760766 -3.603761 -0.757128
H  -1.304544 -2.630023 -0.594451
H  -3.199853 4.864062 0.304904
H  -2.667105 4.122657 1.811231
H  -1.488653 4.519055 0.548163
elementType: S P O C H
totalener: -2042.20003615 hartree
nucrepener: 1694.60838081 hartree
electener: -3736.80841696 hartree
oneelecener: -6184.49646401 hartree
twoeener: 2447.68804705 hartree
cpcmener: -0.01515135 hartree
kineticenergy: 2036.95634337 hartree
xcener: -124.855111276067 hartree
chargesum: 0.0000000
charge: -0.167165 -0.148246 -0.462203 0.662328 -0.358464 -0.343132 0.191291 -0.290625 -0.298774 -0.319653 -0.115480 0.043156 0.025631 -0.242160 -0.239151 0.097560 0.104702 0.104699 0.049594 0.100176 0.103911 0.098944 0.098423 0.099477 0.164344 0.113135 0.107515 0.093504 0.090118 0.108165 0.093225 0.100870 0.072362 0.086720 0.088827 0.086375
qa: -0.1672 -0.1482 -0.4622 0.6623 -0.3585 -0.3431 0.1913 -0.2906 -0.2988 -0.3197 -0.1155 0.0432 0.0256 -0.2422 -0.2392 0.0976 0.1047 0.1047 0.0496 0.1002 0.1039 0.0989 0.0984 0.0995 0.1643 0.1131 0.1075 0.0935 0.0901 0.1082 0.0932 0.1009 0.0724 0.0867 0.0888 0.0864
va: 2.2349 2.2968 1.9778 5.4134 2.0961 2.1191 3.8812 3.8642 3.9060 3.9455 3.9743 3.8533 3.8566 3.9126 3.9513 1.0039 1.0106 1.0116 1.0344 1.0133 1.0098 1.0011 1.0144 1.0032 1.0029 1.0491 0.9912 1.0137 1.0069 0.9918 1.0036 1.0130 1.0020 1.0070 1.0040 1.0055
dispcorr: -0.017696697 hartree
energy: -2042.217732847306
dipole: 6.67544 -7.40698 -0.73153 -5.21170 5.15205 -0.05965 -7.73878 7.26818 -0.47060
magnitude: 0.87187 au
magnitude: 2.21612 debye
