program: Orca
programVersion: 5.0.2
elementType: S S S P O O C C C C C C C C C H H H H H H H H H H H H H H H H H H H H H
charge: 0
multiplicity: 1
keywords: wb97x-d3
keywords: def2-TZVPP
keywords: def2/J RIJCOSX
keywords: DEFGRID2
keywords: scfconv7
keywords: smallprint printgap noloewdin
keywords: NOSOSCF
formula: C9H21O2PS3
InChI: InChI=1/C9H21O2PS3/c1-6-10-12(13,11-7-2)15-8-14-9(3,4)5/h6-8H2,1-5H3
36 atoms
S  1.994793 -1.024005 -0.964591
S  0.290484 0.966533 0.654099
S  -1.370946 1.044038 -2.321497
P  -1.397398 0.479754 -0.480122
O  -1.677448 -1.081006 -0.349933
O  -2.547776 1.102809 0.446507
C  3.284899 -1.50476 0.26465
C  3.462241 -3.003893 0.043298
C  4.58531 -0.771757 -0.035514
C  2.833544 -1.236601 1.692577
C  1.625425 0.685101 -0.563024
C  -1.326631 -1.920744 0.769807
C  -2.757111 2.525407 0.537536
C  -2.067752 -1.595941 2.043127
C  -4.208011 2.775617 0.857197
H  4.247639 -3.379666 0.702433
H  2.548735 -3.557708 0.266299
H  3.757769 -3.233593 -0.982236
H  4.48229 0.309775 0.068318
H  4.938855 -0.981516 -1.045138
H  5.362269 -1.087739 0.664892
H  2.735576 -0.170772 1.9041
H  1.880582 -1.717449 1.916354
H  3.579382 -1.631217 2.387802
H  2.499079 1.202001 -0.163978
H  1.34808 1.195232 -1.486408
H  -1.572997 -2.926802 0.432403
H  -0.246149 -1.878989 0.919362
H  -2.109664 2.923892 1.321343
H  -2.480705 3.004732 -0.40464
H  -1.839913 -2.371672 2.776013
H  -1.764694 -0.643014 2.476908
H  -3.147741 -1.586959 1.894691
H  -4.500025 2.305384 1.796749
H  -4.371336 3.849262 0.957038
H  -4.860731 2.408945 0.06442
elementType: S P O C H
totalener: -2042.19910207 hartree
nucrepener: 1712.82214683 hartree
electener: -3755.02124890 hartree
oneelecener: -6220.89583307 hartree
twoeener: 2465.87458416 hartree
cpcmener: -0.02063209 hartree
kineticenergy: 2036.94974301 hartree
xcener: -124.855992177337 hartree
chargesum: -0.0000000
charge: -0.171750 -0.173117 -0.449700 0.629511 -0.338419 -0.339505 0.195570 -0.295877 -0.315126 -0.340796 -0.135336 0.059524 0.033585 -0.240703 -0.240640 0.098893 0.105903 0.105628 0.100843 0.097281 0.098802 0.087390 0.113371 0.110537 0.150409 0.163011 0.111536 0.055104 0.099724 0.092798 0.099054 0.074505 0.094643 0.088679 0.087352 0.087317
qa: -0.1717 -0.1731 -0.4497 0.6295 -0.3384 -0.3395 0.1956 -0.2959 -0.3151 -0.3408 -0.1353 0.0595 0.0336 -0.2407 -0.2406 0.0989 0.1059 0.1056 0.1008 0.0973 0.0988 0.0874 0.1134 0.1105 0.1504 0.1630 0.1115 0.0551 0.0997 0.0928 0.0991 0.0745 0.0946 0.0887 0.0874 0.0873
va: 2.2316 2.2756 2.0187 5.4447 2.1131 2.0842 3.8447 3.8814 3.9355 3.9439 3.9792 3.8692 3.8437 3.9176 3.9696 1.0040 1.0071 1.0086 1.0037 1.0141 1.0035 1.0005 0.9938 1.0061 1.0064 1.0235 0.9933 1.0230 0.9939 1.0082 1.0082 1.0137 1.0064 1.0031 1.0066 1.0068
dispcorr: -0.017916896 hartree
energy: -2042.217018966392
dipole: 11.37182 -10.14163 1.23019 -7.29446 7.24741 -0.04705 16.84804 -14.30016 2.54788
magnitude: 2.82972 au
magnitude: 7.19257 debye
