program: Orca
programVersion: 5.0.2
elementType: S S S P O O C C C C C C C C C H H H H H H H H H H H H H H H H H H H H H
charge: 0
multiplicity: 1
keywords: wb97x-d3
keywords: def2-TZVPP
keywords: def2/J RIJCOSX
keywords: DEFGRID2
keywords: scfconv7
keywords: smallprint printgap noloewdin
keywords: NOSOSCF
formula: C9H21O2PS3
InChI: InChI=1/C9H21O2PS3/c1-6-10-12(13,11-7-2)15-8-14-9(3,4)5/h6-8H2,1-5H3
36 atoms
S  2.230221 0.304091 -0.927433
S  -0.096883 -1.094649 0.529959
S  -1.626909 -0.092525 -2.352696
P  -1.460166 0.154104 -0.450347
O  -2.773443 -0.122229 0.427193
O  -1.135146 1.668288 -0.085931
C  3.609163 0.100709 0.282673
C  3.088867 -0.159939 1.688558
C  4.533248 -1.023024 -0.166735
C  4.342942 1.437729 0.235528
C  1.242688 -1.177764 -0.711853
C  -3.509602 -1.355578 0.313576
C  -0.500745 2.141562 1.119729
C  -4.950043 -1.0900 0.665839
C  -1.311272 1.924564 2.372822
H  2.397905 0.616515 2.017238
H  2.58319 -1.122652 1.772473
H  3.928716 -0.179544 2.387787
H  4.938219 -0.835444 -1.160924
H  4.027094 -1.989714 -0.185786
H  5.372262 -1.115999 0.526821
H  4.703868 1.671534 -0.767965
H  3.708012 2.259943 0.569626
H  5.212379 1.400383 0.895324
H  0.791109 -1.423455 -1.673377
H  1.858459 -2.029889 -0.421753
H  -3.42698 -1.746522 -0.703317
H  -3.069998 -2.087742 0.993757
H  0.486425 1.683836 1.202821
H  -0.356014 3.206176 0.941146
H  -5.507016 -2.026056 0.617219
H  -5.051671 -0.694792 1.677171
H  -5.409941 -0.389422 -0.031437
H  -1.386557 0.873549 2.651189
H  -0.812368 2.441691 3.193928
H  -2.316227 2.337494 2.283532
elementType: S P O C H
totalener: -2042.19898888 hartree
nucrepener: 1713.68583303 hartree
electener: -3755.88482191 hartree
oneelecener: -6222.62232702 hartree
twoeener: 2466.73750511 hartree
cpcmener: -0.02062289 hartree
kineticenergy: 2036.95544567 hartree
xcener: -124.857155849880 hartree
chargesum: 0.0000000
charge: -0.172534 -0.174614 -0.449759 0.631647 -0.340567 -0.337587 0.199407 -0.344014 -0.316330 -0.296807 -0.132379 0.035035 0.058590 -0.240590 -0.240339 0.114104 0.088277 0.110714 0.097511 0.100612 0.099072 0.105635 0.105973 0.098451 0.162894 0.149250 0.092325 0.098550 0.055371 0.111276 0.087514 0.088283 0.087066 0.074270 0.098881 0.094808
qa: -0.1725 -0.1746 -0.4498 0.6316 -0.3406 -0.3376 0.1994 -0.3440 -0.3163 -0.2968 -0.1324 0.0350 0.0586 -0.2406 -0.2403 0.1141 0.0883 0.1107 0.0975 0.1006 0.0991 0.1056 0.1060 0.0985 0.1629 0.1492 0.0923 0.0985 0.0554 0.1113 0.0875 0.0883 0.0871 0.0743 0.0989 0.0948
va: 2.2337 2.2757 2.0188 5.4414 2.0835 2.1133 3.8410 3.9443 3.9361 3.8814 3.9783 3.8445 3.8710 3.9702 3.9166 0.9935 1.0006 1.0060 1.0141 1.0037 1.0034 1.0085 1.0070 1.0040 1.0236 1.0072 1.0081 0.9945 1.0226 0.9933 1.0064 1.0032 1.0068 1.0138 1.0083 1.0060
dispcorr: -0.017904490 hartree
energy: -2042.216893373652
dipole: 13.12862 -11.99765 1.13098 -0.04876 -0.74514 -0.79391 16.88975 -14.44186 2.44789
magnitude: 2.81097 au
magnitude: 7.14492 debye
