program: Orca
programVersion: 5.0.2
elementType: S S S P O O C C C C C C C C C H H H H H H H H H H H H H H H H H H H H H
charge: 0
multiplicity: 1
keywords: wb97x-d3
keywords: def2-TZVPP
keywords: def2/J RIJCOSX
keywords: DEFGRID2
keywords: scfconv7
keywords: smallprint printgap noloewdin
keywords: NOSOSCF
formula: C9H21O2PS3
InChI: InChI=1/C9H21O2PS3/c1-6-10-12(13,11-7-2)15-8-14-9(3,4)5/h6-8H2,1-5H3
36 atoms
S  2.255423 -0.122209 1.124865
S  -0.488232 -1.313072 1.136587
S  -0.933234 -0.527809 -2.139961
P  -1.268494 -0.016389 -0.315795
O  -2.788149 0.020923 0.184271
O  -0.768897 1.462333 -0.018433
C  3.461625 0.109646 -0.251299
C  4.196424 -1.188718 -0.554245
C  2.758239 0.644009 -1.489755
C  4.436739 1.151794 0.289865
C  1.223791 -1.497206 0.555612
C  -3.701855 -1.070735 -0.059844
C  -0.787031 2.088385 1.282966
C  -4.631536 -0.749009 -1.20229
C  -1.955337 3.032084 1.421275
H  4.958994 -1.013822 -1.317663
H  4.694885 -1.584177 0.33164
H  3.528459 -1.960613 -0.940173
H  3.488819 0.819364 -2.283929
H  2.251208 1.587242 -1.284669
H  2.017762 -0.053632 -1.881977
H  4.968241 0.791743 1.172174
H  5.181103 1.385263 -0.474287
H  3.932783 2.084034 0.552018
H  1.222671 -1.584323 -0.53186
H  1.565334 -2.447332 0.965578
H  -3.153916 -1.996573 -0.253742
H  -4.25318 -1.206525 0.870473
H  -0.795246 1.332746 2.071045
H  0.158248 2.623722 1.358527
H  -4.093438 -0.660823 -2.145998
H  -5.361348 -1.553267 -1.304736
H  -5.178974 0.177092 -1.023458
H  -1.959955 3.783804 0.631498
H  -2.911502 2.510027 1.412733
H  -1.871083 3.5552 2.374926
elementType: S P O C H
totalener: -2042.19802232 hartree
nucrepener: 1719.31594174 hartree
electener: -3761.51396406 hartree
oneelecener: -6234.11105469 hartree
twoeener: 2472.59709062 hartree
cpcmener: -0.01643933 hartree
kineticenergy: 2036.95149285 hartree
xcener: -124.855095379890 hartree
chargesum: 0.0000000
charge: -0.184047 -0.166064 -0.440399 0.646513 -0.349628 -0.331586 0.197667 -0.319446 -0.326869 -0.292811 -0.109299 0.030381 0.049265 -0.235044 -0.247658 0.100297 0.098641 0.096843 0.103898 0.095073 0.089012 0.103938 0.097564 0.104235 0.122810 0.156877 0.086354 0.110699 0.092454 0.097420 0.076234 0.093291 0.089036 0.087965 0.082765 0.093623
qa: -0.1840 -0.1661 -0.4404 0.6465 -0.3496 -0.3316 0.1977 -0.3194 -0.3269 -0.2928 -0.1093 0.0304 0.0493 -0.2350 -0.2477 0.1003 0.0986 0.0968 0.1039 0.0951 0.0890 0.1039 0.0976 0.1042 0.1228 0.1569 0.0864 0.1107 0.0925 0.0974 0.0762 0.0933 0.0890 0.0880 0.0828 0.0936
va: 2.2074 2.2899 2.0169 5.4322 2.0919 2.0980 3.8651 3.9282 3.9343 3.8669 3.9825 3.8515 3.8294 3.9377 3.9669 1.0042 1.0125 1.0011 1.0093 1.0136 1.0174 1.0117 1.0042 1.0107 1.0318 0.9979 1.0106 0.9934 1.0113 0.9966 1.0202 1.0074 1.0039 1.0041 1.0144 1.0061
dispcorr: -0.018308729 hartree
energy: -2042.216331050606
dipole: 8.98880 -8.94408 0.04472 6.45730 -6.61815 -0.16085 -0.98781 1.96864 0.98083
magnitude: 0.99493 au
magnitude: 2.52892 debye
