program: Orca
programVersion: 5.0.2
elementType: S S S P O O C C C C C C C C C H H H H H H H H H H H H H H H H H H H H H
charge: 0
multiplicity: 1
keywords: wb97x-d3
keywords: def2-TZVPP
keywords: def2/J RIJCOSX
keywords: DEFGRID2
keywords: scfconv7
keywords: smallprint printgap noloewdin
keywords: NOSOSCF
formula: C9H21O2PS3
InChI: InChI=1/C9H21O2PS3/c1-6-10-12(13,11-7-2)15-8-14-9(3,4)5/h6-8H2,1-5H3
36 atoms
S  2.100459 0.205942 -0.936613
S  0.108952 -1.76157 0.405079
S  -1.588171 0.0968 -1.904531
P  -1.297603 -0.286314 -0.035852
O  -2.481848 -0.972648 0.792557
O  -0.923126 0.982665 0.86738
C  3.502811 0.12272 0.259655
C  4.575618 -0.833123 -0.243693
C  4.043161 1.550764 0.278509
C  3.031651 -0.275901 1.649994
C  1.349036 -1.426351 -0.894559
C  -3.735656 -0.306706 1.052569
C  -0.618643 2.292267 0.35431
C  -4.788727 -0.702756 0.047117
C  -1.843607 3.1732 0.343476
H  5.420985 -0.83657 0.448531
H  4.21637 -1.861085 -0.311955
H  4.94794 -0.538223 -1.22465
H  4.911197 1.603629 0.938693
H  3.301013 2.260108 0.648897
H  4.364287 1.879393 -0.7119
H  3.866319 -0.204157 2.352105
H  2.232159 0.373031 2.00834
H  2.670542 -1.303734 1.682106
H  0.871127 -1.57502 -1.862437
H  2.097196 -2.211113 -0.781949
H  -4.021847 -0.617994 2.056905
H  -3.603222 0.777309 1.074005
H  0.14646 2.692357 1.019122
H  -0.182914 2.215645 -0.641669
H  -5.742713 -0.267485 0.345918
H  -4.552119 -0.34052 -0.952064
H  -4.915098 -1.784953 0.006942
H  -2.605475 2.792537 -0.337471
H  -2.279115 3.273965 1.338178
H  -1.562574 4.17068 0.001684
elementType: S P O C H
totalener: -2042.19745312 hartree
nucrepener: 1725.28881753 hartree
electener: -3767.48627065 hartree
oneelecener: -6246.18701742 hartree
twoeener: 2478.70074677 hartree
cpcmener: -0.01736767 hartree
kineticenergy: 2036.95141735 hartree
xcener: -124.857110918193 hartree
chargesum: 0.0000000
charge: -0.175813 -0.155241 -0.457159 0.649094 -0.347946 -0.348153 0.193804 -0.319367 -0.295417 -0.325660 -0.148392 0.028648 0.068705 -0.239165 -0.261679 0.098766 0.100965 0.097270 0.098590 0.104819 0.104515 0.104293 0.098755 0.092620 0.159513 0.154486 0.105691 0.094772 0.103919 0.082899 0.093545 0.076507 0.089380 0.077277 0.092332 0.102827
qa: -0.1758 -0.1552 -0.4572 0.6491 -0.3479 -0.3482 0.1938 -0.3194 -0.2954 -0.3257 -0.1484 0.0286 0.0687 -0.2392 -0.2617 0.0988 0.1010 0.0973 0.0986 0.1048 0.1045 0.1043 0.0988 0.0926 0.1595 0.1545 0.1057 0.0948 0.1039 0.0829 0.0935 0.0765 0.0894 0.0773 0.0923 0.1028
va: 2.2367 2.2975 1.9719 5.4145 2.1116 2.0590 3.8599 3.9326 3.8757 3.9314 3.9832 3.9017 3.8096 3.9160 3.9508 1.0033 1.0041 1.0135 1.0045 1.0084 1.0097 1.0069 1.0118 1.0033 1.0191 1.0041 0.9926 0.9875 0.9907 1.0161 1.0085 1.0206 1.0046 1.0131 1.0019 1.0104
dispcorr: -0.018314124 hartree
energy: -2042.215767239878
dipole: 10.00423 -9.35028 0.65395 10.25929 -9.58224 0.67706 7.52026 -6.24686 1.27340
magnitude: 1.58354 au
magnitude: 4.02504 debye
